{"text_format":"1","workbook":"xlsx","n_sheets":4,"sheets":["PLC","M172P_EEPROM","M172P_STATUS","CONTACT"],"not_rendered":{"charts":0,"images":15,"macros":1,"external_links":0,"defined_names":1,"comments":0,"pivot_tables":0},"unopened":[],"bounds":{"document_bytes":16777216,"sheet_cells":100000,"rows_first":2000,"rows_last":500,"rows_between":2000,"halvings":0,"cell_chars":16384,"cell_head_chars":4096},"cells_cut":0,"cells_raw":0,"read":"whole","date_system":"1900"}

{"sheet":"PLC","index":0,"n_rows":507,"n_cols":70,"rows_kept":507,"cut":false,"hidden":false,"merged":[]}
[]
[]
[]
[]
[]
[null,null,null,null,null,null,null,null,null,null,null,null,null,null,null,null,null,null,null,null,null,null,null,null,"'5.1.0"," Vijeo-Designer 6.1.3 CSV output"]
[null,"INDEX",null,"#","Address","Name","Device Type","Application Type","Size","Default Value","Min","Max","Scale","Offset","Unit","Format","Access Level","Description","Note",null,"FOLDER NAME:","Test",null,null,"Type","Name","Data Type","Data Source","Dimension","Description","Initial Value","NumofBytes","Data Sharing","Alarm","Espanol ID","Alarm Message","Alarm Type","Trigger Condition","Deadband","Target","LoLo\\Lo\\Hi\\HiHi","Minor","Major","Alarm Group","Severity","Vibration Pattern","Vibration Time","Sound File","Play Mode","Scan Group","Device Address","Bit Number","Data Format","Signed","Data Length","Offset Bit No","Bit Width","InputRange","Min","Max","DataScaling","RawMin","RawMax","ScaledMin","ScaledMax","IndirectEnabled","IndirectAddress","Retentive","LoggingGroup","LogUserOperationsOnVariable"]
[null,0,null,0,16384,"xVariable",5,"BOOL",null,0,null,null,1,0,null,null,3,null,null,null,"DATA SOURCE:","External",null,null,"Folder",{"$f":"$V$7","v":"Test"}]
[null,1,null,1,16385,"iVariable",0,"INT",null,0,null,null,1,0,null,null,3,null,null,null,"DATA SHARING:","None",null,null,{"$f":"IF(IFERROR(Z9,\"\")=\"\",\"\",\"Variable\")","v":"Variable"},{"$f":"IF(F8=\"\",\"\",CONCATENATE($V$7,\".\",F8))","v":"Test.xVariable"},{"$f":"IF(H8=\"\",\"\",IF(H8=\"BYTE\",\"Integer\",IF(H8=\"WORD\",\"UINT\",IF(H8=\"DWORD\",\"UDINT\",H8))))","v":"BOOL"},{"$f":"IF(AA9=\"\",\"\",$V$8)","v":"External"},{"$f":"IF(AA9=\"\",\"\",$V$13)","v":0},{"$f":"IF(F8=\"\",\"\",CONCATENATE(R8))","v":""},{"$f":"IF(AA9=\"\",\"\",J8)","v":0},{"$f":"IF(AA9=\"\",\"\",IF(AA9=\"BOOL\",\"\", IF(AA9=\"INT\",\"\",IF(AA9=\"DINT\",\"\",IF(AA9=\"UINT\",\"\",IF(AA9=\"REAL\",\"\",IF(AA9=\"Integer\",\"\",IF(AA9=\"UDINT\",\"\",\"\")))))) ))","v":""},{"$f":"IF(AA9=\"\",\"\",$V$9)","v":"None"},{"$f":"IF(AA9=\"\",\"\",$V$10)","v":"Disable"},{"$f":"IF(AA9=\"\",\"\",$V$11)","v":1},{"$f":"IF(AA9=\"\",\"\",IF(AA9=\"BOOL\",\"\", IF(AA9=\"INT\",\"\",IF(AA9=\"DINT\",\"\",IF(AA9=\"UINT\",\"\",IF(AA9=\"REAL\",\"\",IF(AA9=\"Integer\",\"\",IF(AA9=\"UDINT\",\"\",\"\")))))) ))","v":""},{"$f":"IF(AA9=\"\",\"\",IF(AA9=\"BOOL\",\"\", IF(AA9=\"INT\",\"\",IF(AA9=\"DINT\",\"\",IF(AA9=\"UINT\",\"\",IF(AA9=\"REAL\",\"\",IF(AA9=\"Integer\",\"\",IF(AA9=\"UDINT\",\"\",\"\")))))) ))","v":""},{"$f":"IF(AA9=\"\",\"\",IF(AA9=\"BOOL\",\"\", IF(AA9=\"INT\",\"\",IF(AA9=\"DINT\",\"\",IF(AA9=\"UINT\",\"\",IF(AA9=\"REAL\",\"\",IF(AA9=\"Integer\",\"\",IF(AA9=\"UDINT\",\"\",\"\")))))) ))","v":""},{"$f":"IF(AA9=\"\",\"\",IF(AA9=\"BOOL\",\"\", IF(AA9=\"INT\",\"\",IF(AA9=\"DINT\",\"\",IF(AA9=\"UINT\",\"\",IF(AA9=\"REAL\",\"\",IF(AA9=\"Integer\",\"\",IF(AA9=\"UDINT\",\"\",\"\")))))) ))","v":""},{"$f":"IF(AA9=\"\",\"\",IF(AA9=\"BOOL\",\"\", IF(AA9=\"INT\",\"\",IF(AA9=\"DINT\",\"\",IF(AA9=\"UINT\",\"\",IF(AA9=\"REAL\",\"\",IF(AA9=\"Integer\",\"\",IF(AA9=\"UDINT\",\"\",\"\")))))) ))","v":""},{"$f":"IF(AA9=\"\",\"\",IF(AA9=\"BOOL\",\"\", IF(AA9=\"INT\",\"\",IF(AA9=\"DINT\",\"\",IF(AA9=\"UINT\",\"\",IF(AA9=\"REAL\",\"\",IF(AA9=\"Integer\",\"\",IF(AA9=\"UDINT\",\"\",\"\")))))) ))","v":""},{"$f":"IF(AA9=\"\",\"\",IF(AA9=\"BOOL\",\"\", IF(AA9=\"INT\",\"\",IF(AA9=\"DINT\",\"\",IF(AA9=\"UINT\",\"\",IF(AA9=\"REAL\",\"\",IF(AA9=\"Integer\",\"\",IF(AA9=\"UDINT\",\"\",\"\")))))) ))","v":""},{"$f":"IF(AA9=\"\",\"\",IF(AA9=\"BOOL\",\"\", IF(AA9=\"INT\",\"\",IF(AA9=\"DINT\",\"\",IF(AA9=\"UINT\",\"\",IF(AA9=\"REAL\",\"\",IF(AA9=\"Integer\",\"\",IF(AA9=\"UDINT\",\"\",\"\")))))) ))","v":""},{"$f":"IF(AA9=\"\",\"\",IF(AA9=\"BOOL\",\"\", IF(AA9=\"INT\",\"\",IF(AA9=\"DINT\",\"\",IF(AA9=\"UINT\",\"\",IF(AA9=\"REAL\",\"\",IF(AA9=\"Integer\",\"\",IF(AA9=\"UDINT\",\"\",\"\")))))) ))","v":""},{"$f":"IF(AA9=\"\",\"\",IF(AA9=\"BOOL\",\"\", IF(AA9=\"INT\",\"\",IF(AA9=\"DINT\",\"\",IF(AA9=\"UINT\",\"\",IF(AA9=\"REAL\",\"\",IF(AA9=\"Integer\",\"\",IF(AA9=\"UDINT\",\"\",\"\")))))) ))","v":""},{"$f":"IF(AA9=\"\",\"\",IF(AA9=\"BOOL\",\"\", IF(AA9=\"INT\",\"\",IF(AA9=\"DINT\",\"\",IF(AA9=\"UINT\",\"\",IF(AA9=\"REAL\",\"\",IF(AA9=\"Integer\",\"\",IF(AA9=\"UDINT\",\"\",\"\")))))) ))","v":""},{"$f":"IF(AA9=\"\",\"\",IF(AA9=\"BOOL\",\"\", IF(AA9=\"INT\",\"\",IF(AA9=\"DINT\",\"\",IF(AA9=\"UINT\",\"\",IF(AA9=\"REAL\",\"\",IF(AA9=\"Integer\",\"\",IF(AA9=\"UDINT\",\"\",\"\")))))) ))","v":""},{"$f":"IF(AA9=\"\",\"\",IF(AA9=\"BOOL\",\"\", IF(AA9=\"INT\",\"\",IF(AA9=\"DINT\",\"\",IF(AA9=\"UINT\",\"\",IF(AA9=\"REAL\",\"\",IF(AA9=\"Integer\",\"\",IF(AA9=\"UDINT\",\"\",\"\")))))) ))","v":""},{"$f":"IF(AA9=\"\",\"\",IF(AA9=\"BOOL\",\"\", IF(AA9=\"INT\",\"\",IF(AA9=\"DINT\",\"\",IF(AA9=\"UINT\",\"\",IF(AA9=\"REAL\",\"\",IF(AA9=\"Integer\",\"\",IF(AA9=\"UDINT\",\"\",\"\")))))) ))","v":""},{"$f":"IF(AA9=\"\",\"\",$V$12)","v":"ModbusEquipment01"},{"$f":"IF(AA9=\"\",\"\",CONCATENATE(\"%MW\",E8))","v":"%MW16384"},{"$f":"IF(AA9=\"\",\"\",IF( AA9=\"BOOL\",CONCATENATE(\"X\",\"0\"),\"\"))","v":"X0"},{"$f":"IF(AA9=\"\",\"\",IF(AA9=\"BOOL\",\"\", IF(AA9=\"INT\",\"BIN\",IF(AA9=\"DINT\",\"BIN\",IF(AA9=\"UINT\",\"BIN\",IF(AA9=\"REAL\",\"\",IF(AA9=\"Integer\",\"BIN\",IF(AA9=\"UDINT\",\"BIN\",\"\")))))) ))","v":""},{"$f":"IF(AA9=\"\",\"\",IF(AA9=\"BOOL\",\"\", IF(AA9=\"INT\",\"2sComplement\",IF(AA9=\"DINT\",\"2sComplement\",IF(AA9=\"UINT\",\"Unsigned\",IF(AA9=\"REAL\",\"\",IF(AA9=\"Integer\",\"Unsigned\",IF(AA9=\"UDINT\",\"Unsigned\",\"\")))))) ))","v":""},{"$f":"IF(AA9=\"\",\"\",IF(AA9=\"BOOL\",\"\", IF(AA9=\"INT\",\"16Bits\",IF(AA9=\"DINT\",\"32Bits\",IF(AA9=\"UINT\",\"16Bits\",IF(AA9=\"REAL\",\"\",IF(AA9=\"Integer\",\"BitField\",IF(AA9=\"UDINT\",\"32Bits\",\"\")))))) ))","v":""},{"$f":"IF(AA9=\"\",\"\",IF(AA9=\"BOOL\",\"\", IF(AA9=\"INT\",\"\",IF(AA9=\"DINT\",\"\",IF(AA9=\"UINT\",\"\",IF(AA9=\"REAL\",\"\",IF(AA9=\"Integer\",\"0\",IF(AA9=\"UDINT\",\"\",\"\")))))) ))","v":""},{"$f":"IF(AA9=\"\",\"\",IF(AA9=\"BOOL\",\"\", IF(AA9=\"INT\",\"\",IF(AA9=\"DINT\",\"\",IF(AA9=\"UINT\",\"\",IF(AA9=\"REAL\",\"\",IF(AA9=\"Integer\",\"8\",IF(AA9=\"UDINT\",\"\",\"\")))))) ))","v":""},{"$f":"IF(AA9=\"\",\"\",IF(AA9=\"BOOL\",\"\", IF(AA9=\"INT\",\"Disable\",IF(AA9=\"DINT\",\"Disable\",IF(AA9=\"UINT\",\"Disable\",IF(AA9=\"REAL\",\"Disable\",IF(AA9=\"Integer\",\"Disable\",IF(AA9=\"UDINT\",\"Disable\",\"\")))))) ))","v":""},{"$f":"IF(AA9=\"\",\"\",IF(AA9=\"BOOL\",\"\", IF(AA9=\"INT\",\"\",IF(AA9=\"DINT\",\"\",IF(AA9=\"UINT\",\"\",IF(AA9=\"REAL\",\"\",IF(AA9=\"Integer\",\"\",IF(AA9=\"UDINT\",\"\",\"\")))))) ))","v":""},{"$f":"IF(AA9=\"\",\"\",IF(AA9=\"BOOL\",\"\", IF(AA9=\"INT\",\"\",IF(AA9=\"DINT\",\"\",IF(AA9=\"UINT\",\"\",IF(AA9=\"REAL\",\"\",IF(AA9=\"Integer\",\"\",IF(AA9=\"UDINT\",\"\",\"\")))))) ))","v":""},{"$f":"IF(AA9=\"\",\"\",IF(AA9=\"BOOL\",\"\", IF(AA9=\"INT\",\"Disable\",IF(AA9=\"DINT\",\"Disable\",IF(AA9=\"UINT\",\"Disable\",IF(AA9=\"REAL\",\"Disable\",IF(AA9=\"Integer\",\"Disable\",IF(AA9=\"UDINT\",\"Disable\",\"\")))))) ))","v":""},{"$f":"IF(AA9=\"\",\"\",IF(AA9=\"BOOL\",\"\", IF(AA9=\"INT\",\"\",IF(AA9=\"DINT\",\"\",IF(AA9=\"UINT\",\"\",IF(AA9=\"REAL\",\"\",IF(AA9=\"Integer\",\"\",IF(AA9=\"UDINT\",\"\",\"\")))))) ))","v":""},{"$f":"IF(AA9=\"\",\"\",IF(AA9=\"BOOL\",\"\", IF(AA9=\"INT\",\"\",IF(AA9=\"DINT\",\"\",IF(AA9=\"UINT\",\"\",IF(AA9=\"REAL\",\"\",IF(AA9=\"Integer\",\"\",IF(AA9=\"UDINT\",\"\",\"\")))))) ))","v":""},{"$f":"IF(AA9=\"\",\"\",IF(AA9=\"BOOL\",\"\", IF(AA9=\"INT\",\"\",IF(AA9=\"DINT\",\"\",IF(AA9=\"UINT\",\"\",IF(AA9=\"REAL\",\"\",IF(AA9=\"Integer\",\"\",IF(AA9=\"UDINT\",\"\",\"\")))))) ))","v":""},{"$f":"IF(AA9=\"\",\"\",IF(AA9=\"BOOL\",\"\", IF(AA9=\"INT\",\"\",IF(AA9=\"DINT\",\"\",IF(AA9=\"UINT\",\"\",IF(AA9=\"REAL\",\"\",IF(AA9=\"Integer\",\"\",IF(AA9=\"UDINT\",\"\",\"\")))))) ))","v":""},{"$f":"IF(AA9=\"\",\"\",IF(AA9=\"BOOL\",\"Disable\", IF(AA9=\"INT\",\"Disable\",IF(AA9=\"DINT\",\"Disable\",IF(AA9=\"UINT\",\"Disable\",IF(AA9=\"REAL\",\"Disable\",IF(AA9=\"Integer\",\"Disable\",IF(AA9=\"UDINT\",\"Disable\",\"\")))))) ))","v":"Disable"},{"$f":"IF(AA9=\"\",\"\",IF(AA9=\"BOOL\",\"\", IF(AA9=\"INT\",\"\",IF(AA9=\"DINT\",\"\",IF(AA9=\"UINT\",\"\",IF(AA9=\"REAL\",\"\",IF(AA9=\"Integer\",\"\",IF(AA9=\"UDINT\",\"\",\"\")))))) ))","v":""},{"$f":"IF(AA9=\"\",\"\",IF(AA9=\"BOOL\",\"\", IF(AA9=\"INT\",\"\",IF(AA9=\"DINT\",\"\",IF(AA9=\"UINT\",\"\",IF(AA9=\"REAL\",\"\",IF(AA9=\"Integer\",\"\",IF(AA9=\"UDINT\",\"\",\"\")))))) ))","v":""},{"$f":"IF(AA9=\"\",\"\",IF(AA9=\"BOOL\",\"None\", IF(AA9=\"INT\",\"None\",IF(AA9=\"DINT\",\"None\",IF(AA9=\"UINT\",\"None\",IF(AA9=\"REAL\",\"None\",IF(AA9=\"Integer\",\"None\",IF(AA9=\"UDINT\",\"None\",\"\")))))) ))","v":"None"},{"$f":"IF(AA9=\"\",\"\",IF(AA9=\"BOOL\",\"Disable\", IF(AA9=\"INT\",\"Disable\",IF(AA9=\"DINT\",\"Disable\",IF(AA9=\"UINT\",\"Disable\",IF(AA9=\"REAL\",\"Disable\",IF(AA9=\"Integer\",\"Disable\",IF(AA9=\"UDINT\",\"Disable\",\"\")))))) ))","v":"Disable"}]
[null,2,null,2,16386,"diVariable",1,"DINT",null,0,null,null,1,0,null,null,3,null,null,null,"ALARM:","Disable",null,null,{"$f":"IF(IFERROR(Z10,\"\")=\"\",\"\",\"Variable\")","v":"Variable"},"Test.iVariable","INT",{"$f":"IF(AA10=\"\",\"\",$V$8)","v":"External"},{"$f":"IF(AA10=\"\",\"\",$V$13)","v":0},"",{"$f":"IF(AA10=\"\",\"\",J9)","v":0},{"$f":"IF(AA10=\"\",\"\",IF(AA10=\"BOOL\",\"\", IF(AA10=\"INT\",\"\",IF(AA10=\"DINT\",\"\",IF(AA10=\"UINT\",\"\",IF(AA10=\"REAL\",\"\",IF(AA10=\"Integer\",\"\",IF(AA10=\"UDINT\",\"\",\"\")))))) ))","v":""},{"$f":"IF(AA10=\"\",\"\",$V$9)","v":"None"},{"$f":"IF(AA10=\"\",\"\",$V$10)","v":"Disable"},{"$f":"IF(AA10=\"\",\"\",$V$11)","v":1},{"$f":"IF(AA10=\"\",\"\",IF(AA10=\"BOOL\",\"\", IF(AA10=\"INT\",\"\",IF(AA10=\"DINT\",\"\",IF(AA10=\"UINT\",\"\",IF(AA10=\"REAL\",\"\",IF(AA10=\"Integer\",\"\",IF(AA10=\"UDINT\",\"\",\"\")))))) ))","v":""},{"$f":"IF(AA10=\"\",\"\",IF(AA10=\"BOOL\",\"\", IF(AA10=\"INT\",\"\",IF(AA10=\"DINT\",\"\",IF(AA10=\"UINT\",\"\",IF(AA10=\"REAL\",\"\",IF(AA10=\"Integer\",\"\",IF(AA10=\"UDINT\",\"\",\"\")))))) ))","v":""},{"$f":"IF(AA10=\"\",\"\",IF(AA10=\"BOOL\",\"\", IF(AA10=\"INT\",\"\",IF(AA10=\"DINT\",\"\",IF(AA10=\"UINT\",\"\",IF(AA10=\"REAL\",\"\",IF(AA10=\"Integer\",\"\",IF(AA10=\"UDINT\",\"\",\"\")))))) ))","v":""},{"$f":"IF(AA10=\"\",\"\",IF(AA10=\"BOOL\",\"\", IF(AA10=\"INT\",\"\",IF(AA10=\"DINT\",\"\",IF(AA10=\"UINT\",\"\",IF(AA10=\"REAL\",\"\",IF(AA10=\"Integer\",\"\",IF(AA10=\"UDINT\",\"\",\"\")))))) ))","v":""},{"$f":"IF(AA10=\"\",\"\",IF(AA10=\"BOOL\",\"\", IF(AA10=\"INT\",\"\",IF(AA10=\"DINT\",\"\",IF(AA10=\"UINT\",\"\",IF(AA10=\"REAL\",\"\",IF(AA10=\"Integer\",\"\",IF(AA10=\"UDINT\",\"\",\"\")))))) ))","v":""},{"$f":"IF(AA10=\"\",\"\",IF(AA10=\"BOOL\",\"\", IF(AA10=\"INT\",\"\",IF(AA10=\"DINT\",\"\",IF(AA10=\"UINT\",\"\",IF(AA10=\"REAL\",\"\",IF(AA10=\"Integer\",\"\",IF(AA10=\"UDINT\",\"\",\"\")))))) ))","v":""},{"$f":"IF(AA10=\"\",\"\",IF(AA10=\"BOOL\",\"\", IF(AA10=\"INT\",\"\",IF(AA10=\"DINT\",\"\",IF(AA10=\"UINT\",\"\",IF(AA10=\"REAL\",\"\",IF(AA10=\"Integer\",\"\",IF(AA10=\"UDINT\",\"\",\"\")))))) ))","v":""},{"$f":"IF(AA10=\"\",\"\",IF(AA10=\"BOOL\",\"\", IF(AA10=\"INT\",\"\",IF(AA10=\"DINT\",\"\",IF(AA10=\"UINT\",\"\",IF(AA10=\"REAL\",\"\",IF(AA10=\"Integer\",\"\",IF(AA10=\"UDINT\",\"\",\"\")))))) ))","v":""},{"$f":"IF(AA10=\"\",\"\",IF(AA10=\"BOOL\",\"\", IF(AA10=\"INT\",\"\",IF(AA10=\"DINT\",\"\",IF(AA10=\"UINT\",\"\",IF(AA10=\"REAL\",\"\",IF(AA10=\"Integer\",\"\",IF(AA10=\"UDINT\",\"\",\"\")))))) ))","v":""},{"$f":"IF(AA10=\"\",\"\",IF(AA10=\"BOOL\",\"\", IF(AA10=\"INT\",\"\",IF(AA10=\"DINT\",\"\",IF(AA10=\"UINT\",\"\",IF(AA10=\"REAL\",\"\",IF(AA10=\"Integer\",\"\",IF(AA10=\"UDINT\",\"\",\"\")))))) ))","v":""},{"$f":"IF(AA10=\"\",\"\",IF(AA10=\"BOOL\",\"\", IF(AA10=\"INT\",\"\",IF(AA10=\"DINT\",\"\",IF(AA10=\"UINT\",\"\",IF(AA10=\"REAL\",\"\",IF(AA10=\"Integer\",\"\",IF(AA10=\"UDINT\",\"\",\"\")))))) ))","v":""},{"$f":"IF(AA10=\"\",\"\",IF(AA10=\"BOOL\",\"\", IF(AA10=\"INT\",\"\",IF(AA10=\"DINT\",\"\",IF(AA10=\"UINT\",\"\",IF(AA10=\"REAL\",\"\",IF(AA10=\"Integer\",\"\",IF(AA10=\"UDINT\",\"\",\"\")))))) ))","v":""},{"$f":"IF(AA10=\"\",\"\",IF(AA10=\"BOOL\",\"\", IF(AA10=\"INT\",\"\",IF(AA10=\"DINT\",\"\",IF(AA10=\"UINT\",\"\",IF(AA10=\"REAL\",\"\",IF(AA10=\"Integer\",\"\",IF(AA10=\"UDINT\",\"\",\"\")))))) ))","v":""},{"$f":"IF(AA10=\"\",\"\",IF(AA10=\"BOOL\",\"\", IF(AA10=\"INT\",\"\",IF(AA10=\"DINT\",\"\",IF(AA10=\"UINT\",\"\",IF(AA10=\"REAL\",\"\",IF(AA10=\"Integer\",\"\",IF(AA10=\"UDINT\",\"\",\"\")))))) ))","v":""},{"$f":"IF(AA10=\"\",\"\",$V$12)","v":"ModbusEquipment01"},"%MW16385",{"$f":"IF(AA10=\"\",\"\",IF( AA10=\"BOOL\",CONCATENATE(\"X\",\"0\"),\"\"))","v":""},{"$f":"IF(AA10=\"\",\"\",IF(AA10=\"BOOL\",\"\", IF(AA10=\"INT\",\"BIN\",IF(AA10=\"DINT\",\"BIN\",IF(AA10=\"UINT\",\"BIN\",IF(AA10=\"REAL\",\"\",IF(AA10=\"Integer\",\"BIN\",IF(AA10=\"UDINT\",\"BIN\",\"\")))))) ))","v":"BIN"},{"$f":"IF(AA10=\"\",\"\",IF(AA10=\"BOOL\",\"\", IF(AA10=\"INT\",\"2sComplement\",IF(AA10=\"DINT\",\"2sComplement\",IF(AA10=\"UINT\",\"Unsigned\",IF(AA10=\"REAL\",\"\",IF(AA10=\"Integer\",\"Unsigned\",IF(AA10=\"UDINT\",\"Unsigned\",\"\")))))) ))","v":"2sComplement"},{"$f":"IF(AA10=\"\",\"\",IF(AA10=\"BOOL\",\"\", IF(AA10=\"INT\",\"16Bits\",IF(AA10=\"DINT\",\"32Bits\",IF(AA10=\"UINT\",\"16Bits\",IF(AA10=\"REAL\",\"\",IF(AA10=\"Integer\",\"BitField\",IF(AA10=\"UDINT\",\"32Bits\",\"\")))))) ))","v":"16Bits"},{"$f":"IF(AA10=\"\",\"\",IF(AA10=\"BOOL\",\"\", IF(AA10=\"INT\",\"\",IF(AA10=\"DINT\",\"\",IF(AA10=\"UINT\",\"\",IF(AA10=\"REAL\",\"\",IF(AA10=\"Integer\",\"0\",IF(AA10=\"UDINT\",\"\",\"\")))))) ))","v":""},{"$f":"IF(AA10=\"\",\"\",IF(AA10=\"BOOL\",\"\", IF(AA10=\"INT\",\"\",IF(AA10=\"DINT\",\"\",IF(AA10=\"UINT\",\"\",IF(AA10=\"REAL\",\"\",IF(AA10=\"Integer\",\"8\",IF(AA10=\"UDINT\",\"\",\"\")))))) ))","v":""},{"$f":"IF(AA10=\"\",\"\",IF(AA10=\"BOOL\",\"\", IF(AA10=\"INT\",\"Disable\",IF(AA10=\"DINT\",\"Disable\",IF(AA10=\"UINT\",\"Disable\",IF(AA10=\"REAL\",\"Disable\",IF(AA10=\"Integer\",\"Disable\",IF(AA10=\"UDINT\",\"Disable\",\"\")))))) ))","v":"Disable"},{"$f":"IF(AA10=\"\",\"\",IF(AA10=\"BOOL\",\"\", IF(AA10=\"INT\",\"\",IF(AA10=\"DINT\",\"\",IF(AA10=\"UINT\",\"\",IF(AA10=\"REAL\",\"\",IF(AA10=\"Integer\",\"\",IF(AA10=\"UDINT\",\"\",\"\")))))) ))","v":""},{"$f":"IF(AA10=\"\",\"\",IF(AA10=\"BOOL\",\"\", IF(AA10=\"INT\",\"\",IF(AA10=\"DINT\",\"\",IF(AA10=\"UINT\",\"\",IF(AA10=\"REAL\",\"\",IF(AA10=\"Integer\",\"\",IF(AA10=\"UDINT\",\"\",\"\")))))) ))","v":""},{"$f":"IF(AA10=\"\",\"\",IF(AA10=\"BOOL\",\"\", IF(AA10=\"INT\",\"Disable\",IF(AA10=\"DINT\",\"Disable\",IF(AA10=\"UINT\",\"Disable\",IF(AA10=\"REAL\",\"Disable\",IF(AA10=\"Integer\",\"Disable\",IF(AA10=\"UDINT\",\"Disable\",\"\")))))) ))","v":"Disable"},{"$f":"IF(AA10=\"\",\"\",IF(AA10=\"BOOL\",\"\", IF(AA10=\"INT\",\"\",IF(AA10=\"DINT\",\"\",IF(AA10=\"UINT\",\"\",IF(AA10=\"REAL\",\"\",IF(AA10=\"Integer\",\"\",IF(AA10=\"UDINT\",\"\",\"\")))))) ))","v":""},{"$f":"IF(AA10=\"\",\"\",IF(AA10=\"BOOL\",\"\", IF(AA10=\"INT\",\"\",IF(AA10=\"DINT\",\"\",IF(AA10=\"UINT\",\"\",IF(AA10=\"REAL\",\"\",IF(AA10=\"Integer\",\"\",IF(AA10=\"UDINT\",\"\",\"\")))))) ))","v":""},{"$f":"IF(AA10=\"\",\"\",IF(AA10=\"BOOL\",\"\", IF(AA10=\"INT\",\"\",IF(AA10=\"DINT\",\"\",IF(AA10=\"UINT\",\"\",IF(AA10=\"REAL\",\"\",IF(AA10=\"Integer\",\"\",IF(AA10=\"UDINT\",\"\",\"\")))))) ))","v":""},{"$f":"IF(AA10=\"\",\"\",IF(AA10=\"BOOL\",\"\", IF(AA10=\"INT\",\"\",IF(AA10=\"DINT\",\"\",IF(AA10=\"UINT\",\"\",IF(AA10=\"REAL\",\"\",IF(AA10=\"Integer\",\"\",IF(AA10=\"UDINT\",\"\",\"\")))))) ))","v":""},{"$f":"IF(AA10=\"\",\"\",IF(AA10=\"BOOL\",\"Disable\", IF(AA10=\"INT\",\"Disable\",IF(AA10=\"DINT\",\"Disable\",IF(AA10=\"UINT\",\"Disable\",IF(AA10=\"REAL\",\"Disable\",IF(AA10=\"Integer\",\"Disable\",IF(AA10=\"UDINT\",\"Disable\",\"\")))))) ))","v":"Disable"},{"$f":"IF(AA10=\"\",\"\",IF(AA10=\"BOOL\",\"\", IF(AA10=\"INT\",\"\",IF(AA10=\"DINT\",\"\",IF(AA10=\"UINT\",\"\",IF(AA10=\"REAL\",\"\",IF(AA10=\"Integer\",\"\",IF(AA10=\"UDINT\",\"\",\"\")))))) ))","v":""},{"$f":"IF(AA10=\"\",\"\",IF(AA10=\"BOOL\",\"\", IF(AA10=\"INT\",\"\",IF(AA10=\"DINT\",\"\",IF(AA10=\"UINT\",\"\",IF(AA10=\"REAL\",\"\",IF(AA10=\"Integer\",\"\",IF(AA10=\"UDINT\",\"\",\"\")))))) ))","v":""},{"$f":"IF(AA10=\"\",\"\",IF(AA10=\"BOOL\",\"None\", IF(AA10=\"INT\",\"None\",IF(AA10=\"DINT\",\"None\",IF(AA10=\"UINT\",\"None\",IF(AA10=\"REAL\",\"None\",IF(AA10=\"Integer\",\"None\",IF(AA10=\"UDINT\",\"None\",\"\")))))) ))","v":"None"},{"$f":"IF(AA10=\"\",\"\",IF(AA10=\"BOOL\",\"Disable\", IF(AA10=\"INT\",\"Disable\",IF(AA10=\"DINT\",\"Disable\",IF(AA10=\"UINT\",\"Disable\",IF(AA10=\"REAL\",\"Disable\",IF(AA10=\"Integer\",\"Disable\",IF(AA10=\"UDINT\",\"Disable\",\"\")))))) ))","v":"Disable"}]
[null,3,null,3,16388,"wVariable",2,"WORD",null,0,null,null,1,0,null,null,3,null,null,null,"ESPAÑOL ID:",1,null,null,"Variable","Test.diVariable","DINT","External",0,"",0,"","None","Disable",1,"","","","","","","","","","","","","","","ModbusEquipment01","%MW16386","","BIN","2sComplement","32Bits","","","Disable","","","Disable","","","","","Disable","","","None","Disable"]
[null,4,null,4,16389,"dwVariable",3,"DWORD",null,0,null,null,1,0,null,null,3,null,null,null,"SCAN GROUP:","ModbusEquipment01",null,null,"Variable","Test.wVariable","UINT","External",0,"",0,"","None","Disable",1,"","","","","","","","","","","","","","","ModbusEquipment01","%MW16388","","BIN","Unsigned","16Bits","","","Disable","","","Disable","","","","","Disable","","","None","Disable"]
[null,5,null,5,16391,"rVariable",4,"REAL",null,0,null,null,1,0,null,null,3,null,null,null,"DIMENSION:",0,null,null,"Variable","Test.dwVariable","UDINT","External",0,"",0,"","None","Disable",1,"","","","","","","","","","","","","","","ModbusEquipment01","%MW16389","","BIN","Unsigned","32Bits","","","Disable","","","Disable","","","","","Disable","","","None","Disable"]
[null,6,null,6,16393,"uiVariable",2,"UINT",null,0,null,null,1,0,null,null,3,null,null,null,null,null,null,null,"Variable","Test.rVariable","REAL","External",0,"",0,"","None","Disable",1,"","","","","","","","","","","","","","","ModbusEquipment01","%MW16391","","","","","","","Disable","","","Disable","","","","","Disable","","","None","Disable"]
[null,7,null,7,16394,"udiVariable",3,"UDINT",null,0,null,null,1,0,null,null,3,null,null,null,null,null,null,null,"Variable","Test.uiVariable","UINT","External",0,"",0,"","None","Disable",1,"","","","","","","","","","","","","","","ModbusEquipment01","%MW16393","","BIN","Unsigned","16Bits","","","Disable","","","Disable","","","","","Disable","","","None","Disable"]
[null,8,null,null,null,null,null,null,null,null,null,null,null,null,null,null,null,null,null,null,null,null,null,null,"Variable","Test.udiVariable","UDINT","External",0,"",0,"","None","Disable",1,"","","","","","","","","","","","","","","ModbusEquipment01","%MW16394","","BIN","Unsigned","32Bits","","","Disable","","","Disable","","","","","Disable","","","None","Disable"]
[null,9,null,null,null,null,null,null,null,null,null,null,null,null,null,null,null,null,null,null,null,null,null,null,"","","","","","","","","","","","","","","","","","","","","","","","","","","","","","","","","","","","","","","","","","","","","",""]
[null,10,null,null,null,null,null,null,null,null,null,null,null,null,null,null,null,null,null,null,null,null,null,null,"","","","","","","","","","","","","","","","","","","","","","","","","","","","","","","","","","","","","","","","","","","","","",""]
[null,11,null,null,null,null,null,null,null,null,null,null,null,null,null,null,null,null,null,null,null,null,null,null,"","","","","","","","","","","","","","","","","","","","","","","","","","","","","","","","","","","","","","","","","","","","","",""]
[null,12,null,null,null,null,null,null,null,null,null,null,null,null,null,null,null,null,null,null,null,null,null,null,"","","","","","","","","","","","","","","","","","","","","","","","","","","","","","","","","","","","","","","","","","","","","",""]
[null,13,null,null,null,null,null,null,null,null,null,null,null,null,null,null,null,null,null,null,null,null,null,null,"","","","","","","","","","","","","","","","","","","","","","","","","","","","","","","","","","","","","","","","","","","","","",""]
[null,14,null,null,null,null,null,null,null,null,null,null,null,null,null,null,null,null,null,null,null,null,null,null,"","","","","","","","","","","","","","","","","","","","","","","","","","","","","","","","","","","","","","","","","","","","","",""]
[null,15,null,null,null,null,null,null,null,null,null,null,null,null,null,null,null,null,null,null,null,null,null,null,"","","","","","","","","","","","","","","","","","","","","","","","","","","","","","","","","","","","","","","","","","","","","",""]
[null,16,null,null,null,null,null,null,null,null,null,null,null,null,null,null,null,null,null,null,null,null,null,null,"","","","","","","","","","","","","","","","","","","","","","","","","","","","","","","","","","","","","","","","","","","","","",""]
[null,17,null,null,null,null,null,null,null,null,null,null,null,null,null,null,null,null,null,null,null,null,null,null,"","","","","","","","","","","","","","","","","","","","","","","","","","","","","","","","","","","","","","","","","","","","","",""]
[null,18,null,null,null,null,null,null,null,null,null,null,null,null,null,null,null,null,null,null,null,null,null,null,"","","","","","","","","","","","","","","","","","","","","","","","","","","","","","","","","","","","","","","","","","","","","",""]
[null,19,null,null,null,null,null,null,null,null,null,null,null,null,null,null,null,null,null,null,null,null,null,null,"","","","","","","","","","","","","","","","","","","","","","","","","","","","","","","","","","","","","","","","","","","","","",""]
[null,20,null,null,null,null,null,null,null,null,null,null,null,null,null,null,null,null,null,null,null,null,null,null,"","","","","","","","","","","","","","","","","","","","","","","","","","","","","","","","","","","","","","","","","","","","","",""]
[null,21,null,null,null,null,null,null,null,null,null,null,null,null,null,null,null,null,null,null,null,null,null,null,"","","","","","","","","","","","","","","","","","","","","","","","","","","","","","","","","","","","","","","","","","","","","",""]
[null,22,null,null,null,null,null,null,null,null,null,null,null,null,null,null,null,null,null,null,null,null,null,null,"","","","","","","","","","","","","","","","","","","","","","","","","","","","","","","","","","","","","","","","","","","","","",""]
[null,23,null,null,null,null,null,null,null,null,null,null,null,null,null,null,null,null,null,null,null,null,null,null,"","","","","","","","","","","","","","","","","","","","","","","","","","","","","","","","","","","","","","","","","","","","","",""]
[null,24,null,null,null,null,null,null,null,null,null,null,null,null,null,null,null,null,null,null,null,null,null,null,"","","","","","","","","","","","","","","","","","","","","","","","","","","","","","","","","","","","","","","","","","","","","",""]
[null,25,null,null,null,null,null,null,null,null,null,null,null,null,null,null,null,null,null,null,null,null,null,null,"","","","","","","","","","","","","","","","","","","","","","","","","","","","","","","","","","","","","","","","","","","","","",""]
[null,26,null,null,null,null,null,null,null,null,null,null,null,null,null,null,null,null,null,null,null,null,null,null,"","","","","","","","","","","","","","","","","","","","","","","","","","","","","","","","","","","","","","","","","","","","","",""]
[null,27,null,null,null,null,null,null,null,null,null,null,null,null,null,null,null,null,null,null,null,null,null,null,"","","","","","","","","","","","","","","","","","","","","","","","","","","","","","","","","","","","","","","","","","","","","",""]
[null,28,null,null,null,null,null,null,null,null,null,null,null,null,null,null,null,null,null,null,null,null,null,null,"","","","","","","","","","","","","","","","","","","","","","","","","","","","","","","","","","","","","","","","","","","","","",""]
[null,29,null,null,null,null,null,null,null,null,null,null,null,null,null,null,null,null,null,null,null,null,null,null,"","","","","","","","","","","","","","","","","","","","","","","","","","","","","","","","","","","","","","","","","","","","","",""]
[null,30,null,null,null,null,null,null,null,null,null,null,null,null,null,null,null,null,null,null,null,null,null,null,"","","","","","","","","","","","","","","","","","","","","","","","","","","","","","","","","","","","","","","","","","","","","",""]
[null,31,null,null,null,null,null,null,null,null,null,null,null,null,null,null,null,null,null,null,null,null,null,null,"","","","","","","","","","","","","","","","","","","","","","","","","","","","","","","","","","","","","","","","","","","","","",""]
[null,32,null,null,null,null,null,null,null,null,null,null,null,null,null,null,null,null,null,null,null,null,null,null,"","","","","","","","","","","","","","","","","","","","","","","","","","","","","","","","","","","","","","","","","","","","","",""]
[null,33,null,null,null,null,null,null,null,null,null,null,null,null,null,null,null,null,null,null,null,null,null,null,"","","","","","","","","","","","","","","","","","","","","","","","","","","","","","","","","","","","","","","","","","","","","",""]
[null,34,null,null,null,null,null,null,null,null,null,null,null,null,null,null,null,null,null,null,null,null,null,null,"","","","","","","","","","","","","","","","","","","","","","","","","","","","","","","","","","","","","","","","","","","","","",""]
[null,35,null,null,null,null,null,null,null,null,null,null,null,null,null,null,null,null,null,null,null,null,null,null,"","","","","","","","","","","","","","","","","","","","","","","","","","","","","","","","","","","","","","","","","","","","","",""]
[null,36,null,null,null,null,null,null,null,null,null,null,null,null,null,null,null,null,null,null,null,null,null,null,"","","","","","","","","","","","","","","","","","","","","","","","","","","","","","","","","","","","","","","","","","","","","",""]
[null,37,null,null,null,null,null,null,null,null,null,null,null,null,null,null,null,null,null,null,null,null,null,null,"","","","","","","","","","","","","","","","","","","","","","","","","","","","","","","","","","","","","","","","","","","","","",""]
[null,38,null,null,null,null,null,null,null,null,null,null,null,null,null,null,null,null,null,null,null,null,null,null,"","","","","","","","","","","","","","","","","","","","","","","","","","","","","","","","","","","","","","","","","","","","","",""]
[null,39,null,null,null,null,null,null,null,null,null,null,null,null,null,null,null,null,null,null,null,null,null,null,"","","","","","","","","","","","","","","","","","","","","","","","","","","","","","","","","","","","","","","","","","","","","",""]
[null,40,null,null,null,null,null,null,null,null,null,null,null,null,null,null,null,null,null,null,null,null,null,null,"","","","","","","","","","","","","","","","","","","","","","","","","","","","","","","","","","","","","","","","","","","","","",""]
[null,41,null,null,null,null,null,null,null,null,null,null,null,null,null,null,null,null,null,null,null,null,null,null,"","","","","","","","","","","","","","","","","","","","","","","","","","","","","","","","","","","","","","","","","","","","","",""]
[null,42,null,null,null,null,null,null,null,null,null,null,null,null,null,null,null,null,null,null,null,null,null,null,"","","","","","","","","","","","","","","","","","","","","","","","","","","","","","","","","","","","","","","","","","","","","",""]
[null,43,null,null,null,null,null,null,null,null,null,null,null,null,null,null,null,null,null,null,null,null,null,null,"","","","","","","","","","","","","","","","","","","","","","","","","","","","","","","","","","","","","","","","","","","","","",""]
[null,44,null,null,null,null,null,null,null,null,null,null,null,null,null,null,null,null,null,null,null,null,null,null,"","","","","","","","","","","","","","","","","","","","","","","","","","","","","","","","","","","","","","","","","","","","","",""]
[null,45,null,null,null,null,null,null,null,null,null,null,null,null,null,null,null,null,null,null,null,null,null,null,"","","","","","","","","","","","","","","","","","","","","","","","","","","","","","","","","","","","","","","","","","","","","",""]
[null,46,null,null,null,null,null,null,null,null,null,null,null,null,null,null,null,null,null,null,null,null,null,null,"","","","","","","","","","","","","","","","","","","","","","","","","","","","","","","","","","","","","","","","","","","","","",""]
[null,47,null,null,null,null,null,null,null,null,null,null,null,null,null,null,null,null,null,null,null,null,null,null,"","","","","","","","","","","","","","","","","","","","","","","","","","","","","","","","","","","","","","","","","","","","","",""]
[null,48,null,null,null,null,null,null,null,null,null,null,null,null,null,null,null,null,null,null,null,null,null,null,"","","","","","","","","","","","","","","","","","","","","","","","","","","","","","","","","","","","","","","","","","","","","",""]
[null,49,null,null,null,null,null,null,null,null,null,null,null,null,null,null,null,null,null,null,null,null,null,null,"","","","","","","","","","","","","","","","","","","","","","","","","","","","","","","","","","","","","","","","","","","","","",""]
[null,50,null,null,null,null,null,null,null,null,null,null,null,null,null,null,null,null,null,null,null,null,null,null,"","","","","","","","","","","","","","","","","","","","","","","","","","","","","","","","","","","","","","","","","","","","","",""]
[null,51,null,null,null,null,null,null,null,null,null,null,null,null,null,null,null,null,null,null,null,null,null,null,"","","","","","","","","","","","","","","","","","","","","","","","","","","","","","","","","","","","","","","","","","","","","",""]
[null,52,null,null,null,null,null,null,null,null,null,null,null,null,null,null,null,null,null,null,null,null,null,null,"","","","","","","","","","","","","","","","","","","","","","","","","","","","","","","","","","","","","","","","","","","","","",""]
[null,53,null,null,null,null,null,null,null,null,null,null,null,null,null,null,null,null,null,null,null,null,null,null,"","","","","","","","","","","","","","","","","","","","","","","","","","","","","","","","","","","","","","","","","","","","","",""]
[null,54,null,null,null,null,null,null,null,null,null,null,null,null,null,null,null,null,null,null,null,null,null,null,"","","","","","","","","","","","","","","","","","","","","","","","","","","","","","","","","","","","","","","","","","","","","",""]
[null,55,null,null,null,null,null,null,null,null,null,null,null,null,null,null,null,null,null,null,null,null,null,null,"","","","","","","","","","","","","","","","","","","","","","","","","","","","","","","","","","","","","","","","","","","","","",""]
[null,56,null,null,null,null,null,null,null,null,null,null,null,null,null,null,null,null,null,null,null,null,null,null,"","","","","","","","","","","","","","","","","","","","","","","","","","","","","","","","","","","","","","","","","","","","","",""]
[null,57,null,null,null,null,null,null,null,null,null,null,null,null,null,null,null,null,null,null,null,null,null,null,"","","","","","","","","","","","","","","","","","","","","","","","","","","","","","","","","","","","","","","","","","","","","",""]
[null,58,null,null,null,null,null,null,null,null,null,null,null,null,null,null,null,null,null,null,null,null,null,null,"","","","","","","","","","","","","","","","","","","","","","","","","","","","","","","","","","","","","","","","","","","","","",""]
[null,59,null,null,null,null,null,null,null,null,null,null,null,null,null,null,null,null,null,null,null,null,null,null,"","","","","","","","","","","","","","","","","","","","","","","","","","","","","","","","","","","","","","","","","","","","","",""]
[null,60,null,null,null,null,null,null,null,null,null,null,null,null,null,null,null,null,null,null,null,null,null,null,"","","","","","","","","","","","","","","","","","","","","","","","","","","","","","","","","","","","","","","","","","","","","",""]
[null,61,null,null,null,null,null,null,null,null,null,null,null,null,null,null,null,null,null,null,null,null,null,null,"","","","","","","","","","","","","","","","","","","","","","","","","","","","","","","","","","","","","","","","","","","","","",""]
[null,62,null,null,null,null,null,null,null,null,null,null,null,null,null,null,null,null,null,null,null,null,null,null,"","","","","","","","","","","","","","","","","","","","","","","","","","","","","","","","","","","","","","","","","","","","","",""]
[null,63,null,null,null,null,null,null,null,null,null,null,null,null,null,null,null,null,null,null,null,null,null,null,"","","","","","","","","","","","","","","","","","","","","","","","","","","","","","","","","","","","","","","","","","","","","",""]
[null,64,null,null,null,null,null,null,null,null,null,null,null,null,null,null,null,null,null,null,null,null,null,null,"","","","","","","","","","","","","","","","","","","","","","","","","","","","","","","","","","","","","","","","","","","","","",""]
[null,65,null,null,null,null,null,null,null,null,null,null,null,null,null,null,null,null,null,null,null,null,null,null,"",{"$f":"IF(F72=\"\",\"\",CONCATENATE($V$7,\".\",F72))","v":""},{"$f":"IF(H72=\"\",\"\",IF(H72=\"BYTE\",\"Integer\",IF(H72=\"WORD\",\"UINT\",IF(H72=\"DWORD\",\"UDINT\",H72))))","v":""},"","",{"$f":"IF(F72=\"\",\"\",CONCATENATE(R72))","v":""},"","","","","","","","","","","","","","","","","","","","",{"$f":"IF(AA73=\"\",\"\",CONCATENATE(\"%MW\",E72))","v":""},"","","","","","","","","","","","","","","","","","",""]
[null,66,null,null,null,null,null,null,null,null,null,null,null,null,null,null,null,null,null,null,null,null,null,null,{"$f":"IF(IFERROR(Z74,\"\")=\"\",\"\",\"Variable\")","v":""},"","",{"$f":"IF(AA74=\"\",\"\",$V$8)","v":""},{"$f":"IF(AA74=\"\",\"\",$V$13)","v":""},"",{"$f":"IF(AA74=\"\",\"\",J73)","v":""},{"$f":"IF(AA74=\"\",\"\",IF(AA74=\"BOOL\",\"\", IF(AA74=\"INT\",\"\",IF(AA74=\"DINT\",\"\",IF(AA74=\"UINT\",\"\",IF(AA74=\"REAL\",\"\",IF(AA74=\"Integer\",\"\",IF(AA74=\"UDINT\",\"\",\"\")))))) ))","v":""},{"$f":"IF(AA74=\"\",\"\",$V$9)","v":""},{"$f":"IF(AA74=\"\",\"\",$V$10)","v":""},{"$f":"IF(AA74=\"\",\"\",$V$11)","v":""},{"$f":"IF(AA74=\"\",\"\",IF(AA74=\"BOOL\",\"\", IF(AA74=\"INT\",\"\",IF(AA74=\"DINT\",\"\",IF(AA74=\"UINT\",\"\",IF(AA74=\"REAL\",\"\",IF(AA74=\"Integer\",\"\",IF(AA74=\"UDINT\",\"\",\"\")))))) ))","v":""},{"$f":"IF(AA74=\"\",\"\",IF(AA74=\"BOOL\",\"\", IF(AA74=\"INT\",\"\",IF(AA74=\"DINT\",\"\",IF(AA74=\"UINT\",\"\",IF(AA74=\"REAL\",\"\",IF(AA74=\"Integer\",\"\",IF(AA74=\"UDINT\",\"\",\"\")))))) ))","v":""},{"$f":"IF(AA74=\"\",\"\",IF(AA74=\"BOOL\",\"\", IF(AA74=\"INT\",\"\",IF(AA74=\"DINT\",\"\",IF(AA74=\"UINT\",\"\",IF(AA74=\"REAL\",\"\",IF(AA74=\"Integer\",\"\",IF(AA74=\"UDINT\",\"\",\"\")))))) ))","v":""},{"$f":"IF(AA74=\"\",\"\",IF(AA74=\"BOOL\",\"\", IF(AA74=\"INT\",\"\",IF(AA74=\"DINT\",\"\",IF(AA74=\"UINT\",\"\",IF(AA74=\"REAL\",\"\",IF(AA74=\"Integer\",\"\",IF(AA74=\"UDINT\",\"\",\"\")))))) ))","v":""},{"$f":"IF(AA74=\"\",\"\",IF(AA74=\"BOOL\",\"\", IF(AA74=\"INT\",\"\",IF(AA74=\"DINT\",\"\",IF(AA74=\"UINT\",\"\",IF(AA74=\"REAL\",\"\",IF(AA74=\"Integer\",\"\",IF(AA74=\"UDINT\",\"\",\"\")))))) ))","v":""},{"$f":"IF(AA74=\"\",\"\",IF(AA74=\"BOOL\",\"\", IF(AA74=\"INT\",\"\",IF(AA74=\"DINT\",\"\",IF(AA74=\"UINT\",\"\",IF(AA74=\"REAL\",\"\",IF(AA74=\"Integer\",\"\",IF(AA74=\"UDINT\",\"\",\"\")))))) ))","v":""},{"$f":"IF(AA74=\"\",\"\",IF(AA74=\"BOOL\",\"\", IF(AA74=\"INT\",\"\",IF(AA74=\"DINT\",\"\",IF(AA74=\"UINT\",\"\",IF(AA74=\"REAL\",\"\",IF(AA74=\"Integer\",\"\",IF(AA74=\"UDINT\",\"\",\"\")))))) ))","v":""},{"$f":"IF(AA74=\"\",\"\",IF(AA74=\"BOOL\",\"\", IF(AA74=\"INT\",\"\",IF(AA74=\"DINT\",\"\",IF(AA74=\"UINT\",\"\",IF(AA74=\"REAL\",\"\",IF(AA74=\"Integer\",\"\",IF(AA74=\"UDINT\",\"\",\"\")))))) ))","v":""},{"$f":"IF(AA74=\"\",\"\",IF(AA74=\"BOOL\",\"\", IF(AA74=\"INT\",\"\",IF(AA74=\"DINT\",\"\",IF(AA74=\"UINT\",\"\",IF(AA74=\"REAL\",\"\",IF(AA74=\"Integer\",\"\",IF(AA74=\"UDINT\",\"\",\"\")))))) ))","v":""},{"$f":"IF(AA74=\"\",\"\",IF(AA74=\"BOOL\",\"\", IF(AA74=\"INT\",\"\",IF(AA74=\"DINT\",\"\",IF(AA74=\"UINT\",\"\",IF(AA74=\"REAL\",\"\",IF(AA74=\"Integer\",\"\",IF(AA74=\"UDINT\",\"\",\"\")))))) ))","v":""},{"$f":"IF(AA74=\"\",\"\",IF(AA74=\"BOOL\",\"\", IF(AA74=\"INT\",\"\",IF(AA74=\"DINT\",\"\",IF(AA74=\"UINT\",\"\",IF(AA74=\"REAL\",\"\",IF(AA74=\"Integer\",\"\",IF(AA74=\"UDINT\",\"\",\"\")))))) ))","v":""},{"$f":"IF(AA74=\"\",\"\",IF(AA74=\"BOOL\",\"\", IF(AA74=\"INT\",\"\",IF(AA74=\"DINT\",\"\",IF(AA74=\"UINT\",\"\",IF(AA74=\"REAL\",\"\",IF(AA74=\"Integer\",\"\",IF(AA74=\"UDINT\",\"\",\"\")))))) ))","v":""},{"$f":"IF(AA74=\"\",\"\",IF(AA74=\"BOOL\",\"\", IF(AA74=\"INT\",\"\",IF(AA74=\"DINT\",\"\",IF(AA74=\"UINT\",\"\",IF(AA74=\"REAL\",\"\",IF(AA74=\"Integer\",\"\",IF(AA74=\"UDINT\",\"\",\"\")))))) ))","v":""},{"$f":"IF(AA74=\"\",\"\",IF(AA74=\"BOOL\",\"\", IF(AA74=\"INT\",\"\",IF(AA74=\"DINT\",\"\",IF(AA74=\"UINT\",\"\",IF(AA74=\"REAL\",\"\",IF(AA74=\"Integer\",\"\",IF(AA74=\"UDINT\",\"\",\"\")))))) ))","v":""},{"$f":"IF(AA74=\"\",\"\",$V$12)","v":""},"",{"$f":"IF(AA74=\"\",\"\",IF( AA74=\"BOOL\",CONCATENATE(\"X\",\"0\"),\"\"))","v":""},{"$f":"IF(AA74=\"\",\"\",IF(AA74=\"BOOL\",\"\", IF(AA74=\"INT\",\"BIN\",IF(AA74=\"DINT\",\"BIN\",IF(AA74=\"UINT\",\"BIN\",IF(AA74=\"REAL\",\"\",IF(AA74=\"Integer\",\"BIN\",IF(AA74=\"UDINT\",\"BIN\",\"\")))))) ))","v":""},{"$f":"IF(AA74=\"\",\"\",IF(AA74=\"BOOL\",\"\", IF(AA74=\"INT\",\"2sComplement\",IF(AA74=\"DINT\",\"2sComplement\",IF(AA74=\"UINT\",\"Unsigned\",IF(AA74=\"REAL\",\"\",IF(AA74=\"Integer\",\"Unsigned\",IF(AA74=\"UDINT\",\"Unsigned\",\"\")))))) ))","v":""},{"$f":"IF(AA74=\"\",\"\",IF(AA74=\"BOOL\",\"\", IF(AA74=\"INT\",\"16Bits\",IF(AA74=\"DINT\",\"32Bits\",IF(AA74=\"UINT\",\"16Bits\",IF(AA74=\"REAL\",\"\",IF(AA74=\"Integer\",\"BitField\",IF(AA74=\"UDINT\",\"32Bits\",\"\")))))) ))","v":""},{"$f":"IF(AA74=\"\",\"\",IF(AA74=\"BOOL\",\"\", IF(AA74=\"INT\",\"\",IF(AA74=\"DINT\",\"\",IF(AA74=\"UINT\",\"\",IF(AA74=\"REAL\",\"\",IF(AA74=\"Integer\",\"0\",IF(AA74=\"UDINT\",\"\",\"\")))))) ))","v":""},{"$f":"IF(AA74=\"\",\"\",IF(AA74=\"BOOL\",\"\", IF(AA74=\"INT\",\"\",IF(AA74=\"DINT\",\"\",IF(AA74=\"UINT\",\"\",IF(AA74=\"REAL\",\"\",IF(AA74=\"Integer\",\"8\",IF(AA74=\"UDINT\",\"\",\"\")))))) ))","v":""},{"$f":"IF(AA74=\"\",\"\",IF(AA74=\"BOOL\",\"\", IF(AA74=\"INT\",\"Disable\",IF(AA74=\"DINT\",\"Disable\",IF(AA74=\"UINT\",\"Disable\",IF(AA74=\"REAL\",\"Disable\",IF(AA74=\"Integer\",\"Disable\",IF(AA74=\"UDINT\",\"Disable\",\"\")))))) ))","v":""},{"$f":"IF(AA74=\"\",\"\",IF(AA74=\"BOOL\",\"\", IF(AA74=\"INT\",\"\",IF(AA74=\"DINT\",\"\",IF(AA74=\"UINT\",\"\",IF(AA74=\"REAL\",\"\",IF(AA74=\"Integer\",\"\",IF(AA74=\"UDINT\",\"\",\"\")))))) ))","v":""},{"$f":"IF(AA74=\"\",\"\",IF(AA74=\"BOOL\",\"\", IF(AA74=\"INT\",\"\",IF(AA74=\"DINT\",\"\",IF(AA74=\"UINT\",\"\",IF(AA74=\"REAL\",\"\",IF(AA74=\"Integer\",\"\",IF(AA74=\"UDINT\",\"\",\"\")))))) ))","v":""},{"$f":"IF(AA74=\"\",\"\",IF(AA74=\"BOOL\",\"\", IF(AA74=\"INT\",\"Disable\",IF(AA74=\"DINT\",\"Disable\",IF(AA74=\"UINT\",\"Disable\",IF(AA74=\"REAL\",\"Disable\",IF(AA74=\"Integer\",\"Disable\",IF(AA74=\"UDINT\",\"Disable\",\"\")))))) ))","v":""},{"$f":"IF(AA74=\"\",\"\",IF(AA74=\"BOOL\",\"\", IF(AA74=\"INT\",\"\",IF(AA74=\"DINT\",\"\",IF(AA74=\"UINT\",\"\",IF(AA74=\"REAL\",\"\",IF(AA74=\"Integer\",\"\",IF(AA74=\"UDINT\",\"\",\"\")))))) ))","v":""},{"$f":"IF(AA74=\"\",\"\",IF(AA74=\"BOOL\",\"\", IF(AA74=\"INT\",\"\",IF(AA74=\"DINT\",\"\",IF(AA74=\"UINT\",\"\",IF(AA74=\"REAL\",\"\",IF(AA74=\"Integer\",\"\",IF(AA74=\"UDINT\",\"\",\"\")))))) ))","v":""},{"$f":"IF(AA74=\"\",\"\",IF(AA74=\"BOOL\",\"\", IF(AA74=\"INT\",\"\",IF(AA74=\"DINT\",\"\",IF(AA74=\"UINT\",\"\",IF(AA74=\"REAL\",\"\",IF(AA74=\"Integer\",\"\",IF(AA74=\"UDINT\",\"\",\"\")))))) ))","v":""},{"$f":"IF(AA74=\"\",\"\",IF(AA74=\"BOOL\",\"\", IF(AA74=\"INT\",\"\",IF(AA74=\"DINT\",\"\",IF(AA74=\"UINT\",\"\",IF(AA74=\"REAL\",\"\",IF(AA74=\"Integer\",\"\",IF(AA74=\"UDINT\",\"\",\"\")))))) ))","v":""},{"$f":"IF(AA74=\"\",\"\",IF(AA74=\"BOOL\",\"Disable\", IF(AA74=\"INT\",\"Disable\",IF(AA74=\"DINT\",\"Disable\",IF(AA74=\"UINT\",\"Disable\",IF(AA74=\"REAL\",\"Disable\",IF(AA74=\"Integer\",\"Disable\",IF(AA74=\"UDINT\",\"Disable\",\"\")))))) ))","v":""},{"$f":"IF(AA74=\"\",\"\",IF(AA74=\"BOOL\",\"\", IF(AA74=\"INT\",\"\",IF(AA74=\"DINT\",\"\",IF(AA74=\"UINT\",\"\",IF(AA74=\"REAL\",\"\",IF(AA74=\"Integer\",\"\",IF(AA74=\"UDINT\",\"\",\"\")))))) ))","v":""},{"$f":"IF(AA74=\"\",\"\",IF(AA74=\"BOOL\",\"\", IF(AA74=\"INT\",\"\",IF(AA74=\"DINT\",\"\",IF(AA74=\"UINT\",\"\",IF(AA74=\"REAL\",\"\",IF(AA74=\"Integer\",\"\",IF(AA74=\"UDINT\",\"\",\"\")))))) ))","v":""},{"$f":"IF(AA74=\"\",\"\",IF(AA74=\"BOOL\",\"None\", IF(AA74=\"INT\",\"None\",IF(AA74=\"DINT\",\"None\",IF(AA74=\"UINT\",\"None\",IF(AA74=\"REAL\",\"None\",IF(AA74=\"Integer\",\"None\",IF(AA74=\"UDINT\",\"None\",\"\")))))) ))","v":""},{"$f":"IF(AA74=\"\",\"\",IF(AA74=\"BOOL\",\"Disable\", IF(AA74=\"INT\",\"Disable\",IF(AA74=\"DINT\",\"Disable\",IF(AA74=\"UINT\",\"Disable\",IF(AA74=\"REAL\",\"Disable\",IF(AA74=\"Integer\",\"Disable\",IF(AA74=\"UDINT\",\"Disable\",\"\")))))) ))","v":""}]
[null,67,null,null,null,null,null,null,null,null,null,null,null,null,null,null,null,null,null,null,null,null,null,null,"","","","","","","","","","","","","","","","","","","","","","","","","","","","","","","","","","","","","","","","","","","","","",""]
[null,68,null,null,null,null,null,null,null,null,null,null,null,null,null,null,null,null,null,null,null,null,null,null,"","","","","","","","","","","","","","","","","","","","","","","","","","","","","","","","","","","","","","","","","","","","","",""]
[null,69,null,null,null,null,null,null,null,null,null,null,null,null,null,null,null,null,null,null,null,null,null,null,"","","","","","","","","","","","","","","","","","","","","","","","","","","","","","","","","","","","","","","","","","","","","",""]
[null,70,null,null,null,null,null,null,null,null,null,null,null,null,null,null,null,null,null,null,null,null,null,null,"","","","","","","","","","","","","","","","","","","","","","","","","","","","","","","","","","","","","","","","","","","","","",""]
[null,71,null,null,null,null,null,null,null,null,null,null,null,null,null,null,null,null,null,null,null,null,null,null,"","","","","","","","","","","","","","","","","","","","","","","","","","","","","","","","","","","","","","","","","","","","","",""]
[null,72,null,null,null,null,null,null,null,null,null,null,null,null,null,null,null,null,null,null,null,null,null,null,"","","","","","","","","","","","","","","","","","","","","","","","","","","","","","","","","","","","","","","","","","","","","",""]
[null,73,null,null,null,null,null,null,null,null,null,null,null,null,null,null,null,null,null,null,null,null,null,null,"","","","","","","","","","","","","","","","","","","","","","","","","","","","","","","","","","","","","","","","","","","","","",""]
[null,74,null,null,null,null,null,null,null,null,null,null,null,null,null,null,null,null,null,null,null,null,null,null,"","","","","","","","","","","","","","","","","","","","","","","","","","","","","","","","","","","","","","","","","","","","","",""]
[null,75,null,null,null,null,null,null,null,null,null,null,null,null,null,null,null,null,null,null,null,null,null,null,"","","","","","","","","","","","","","","","","","","","","","","","","","","","","","","","","","","","","","","","","","","","","",""]
[null,76,null,null,null,null,null,null,null,null,null,null,null,null,null,null,null,null,null,null,null,null,null,null,"","","","","","","","","","","","","","","","","","","","","","","","","","","","","","","","","","","","","","","","","","","","","",""]
[null,77,null,null,null,null,null,null,null,null,null,null,null,null,null,null,null,null,null,null,null,null,null,null,"","","","","","","","","","","","","","","","","","","","","","","","","","","","","","","","","","","","","","","","","","","","","",""]
[null,78,null,null,null,null,null,null,null,null,null,null,null,null,null,null,null,null,null,null,null,null,null,null,"","","","","","","","","","","","","","","","","","","","","","","","","","","","","","","","","","","","","","","","","","","","","",""]
[null,79,null,null,null,null,null,null,null,null,null,null,null,null,null,null,null,null,null,null,null,null,null,null,"","","","","","","","","","","","","","","","","","","","","","","","","","","","","","","","","","","","","","","","","","","","","",""]
[null,80,null,null,null,null,null,null,null,null,null,null,null,null,null,null,null,null,null,null,null,null,null,null,"","","","","","","","","","","","","","","","","","","","","","","","","","","","","","","","","","","","","","","","","","","","","",""]
[null,81,null,null,null,null,null,null,null,null,null,null,null,null,null,null,null,null,null,null,null,null,null,null,"","","","","","","","","","","","","","","","","","","","","","","","","","","","","","","","","","","","","","","","","","","","","",""]
[null,82,null,null,null,null,null,null,null,null,null,null,null,null,null,null,null,null,null,null,null,null,null,null,"","","","","","","","","","","","","","","","","","","","","","","","","","","","","","","","","","","","","","","","","","","","","",""]
[null,83,null,null,null,null,null,null,null,null,null,null,null,null,null,null,null,null,null,null,null,null,null,null,"","","","","","","","","","","","","","","","","","","","","","","","","","","","","","","","","","","","","","","","","","","","","",""]
[null,84,null,null,null,null,null,null,null,null,null,null,null,null,null,null,null,null,null,null,null,null,null,null,"","","","","","","","","","","","","","","","","","","","","","","","","","","","","","","","","","","","","","","","","","","","","",""]
[null,85,null,null,null,null,null,null,null,null,null,null,null,null,null,null,null,null,null,null,null,null,null,null,"","","","","","","","","","","","","","","","","","","","","","","","","","","","","","","","","","","","","","","","","","","","","",""]
[null,86,null,null,null,null,null,null,null,null,null,null,null,null,null,null,null,null,null,null,null,null,null,null,"","","","","","","","","","","","","","","","","","","","","","","","","","","","","","","","","","","","","","","","","","","","","",""]
[null,87,null,null,null,null,null,null,null,null,null,null,null,null,null,null,null,null,null,null,null,null,null,null,"","","","","","","","","","","","","","","","","","","","","","","","","","","","","","","","","","","","","","","","","","","","","",""]
[null,88,null,null,null,null,null,null,null,null,null,null,null,null,null,null,null,null,null,null,null,null,null,null,"","","","","","","","","","","","","","","","","","","","","","","","","","","","","","","","","","","","","","","","","","","","","",""]
[null,89,null,null,null,null,null,null,null,null,null,null,null,null,null,null,null,null,null,null,null,null,null,null,"","","","","","","","","","","","","","","","","","","","","","","","","","","","","","","","","","","","","","","","","","","","","",""]
[null,90,null,null,null,null,null,null,null,null,null,null,null,null,null,null,null,null,null,null,null,null,null,null,"","","","","","","","","","","","","","","","","","","","","","","","","","","","","","","","","","","","","","","","","","","","","",""]
[null,91,null,null,null,null,null,null,null,null,null,null,null,null,null,null,null,null,null,null,null,null,null,null,"","","","","","","","","","","","","","","","","","","","","","","","","","","","","","","","","","","","","","","","","","","","","",""]
[null,92,null,null,null,null,null,null,null,null,null,null,null,null,null,null,null,null,null,null,null,null,null,null,"","","","","","","","","","","","","","","","","","","","","","","","","","","","","","","","","","","","","","","","","","","","","",""]
[null,93,null,null,null,null,null,null,null,null,null,null,null,null,null,null,null,null,null,null,null,null,null,null,"","","","","","","","","","","","","","","","","","","","","","","","","","","","","","","","","","","","","","","","","","","","","",""]
[null,94,null,null,null,null,null,null,null,null,null,null,null,null,null,null,null,null,null,null,null,null,null,null,"","","","","","","","","","","","","","","","","","","","","","","","","","","","","","","","","","","","","","","","","","","","","",""]
[null,95,null,null,null,null,null,null,null,null,null,null,null,null,null,null,null,null,null,null,null,null,null,null,"","","","","","","","","","","","","","","","","","","","","","","","","","","","","","","","","","","","","","","","","","","","","",""]
[null,96,null,null,null,null,null,null,null,null,null,null,null,null,null,null,null,null,null,null,null,null,null,null,"","","","","","","","","","","","","","","","","","","","","","","","","","","","","","","","","","","","","","","","","","","","","",""]
[null,97,null,null,null,null,null,null,null,null,null,null,null,null,null,null,null,null,null,null,null,null,null,null,"","","","","","","","","","","","","","","","","","","","","","","","","","","","","","","","","","","","","","","","","","","","","",""]
[null,98,null,null,null,null,null,null,null,null,null,null,null,null,null,null,null,null,null,null,null,null,null,null,"","","","","","","","","","","","","","","","","","","","","","","","","","","","","","","","","","","","","","","","","","","","","",""]
[null,99,null,null,null,null,null,null,null,null,null,null,null,null,null,null,null,null,null,null,null,null,null,null,"","","","","","","","","","","","","","","","","","","","","","","","","","","","","","","","","","","","","","","","","","","","","",""]
[null,100,null,null,null,null,null,null,null,null,null,null,null,null,null,null,null,null,null,null,null,null,null,null,"","","","","","","","","","","","","","","","","","","","","","","","","","","","","","","","","","","","","","","","","","","","","",""]
[null,101,null,null,null,null,null,null,null,null,null,null,null,null,null,null,null,null,null,null,null,null,null,null,"","","","","","","","","","","","","","","","","","","","","","","","","","","","","","","","","","","","","","","","","","","","","",""]
[null,102,null,null,null,null,null,null,null,null,null,null,null,null,null,null,null,null,null,null,null,null,null,null,"","","","","","","","","","","","","","","","","","","","","","","","","","","","","","","","","","","","","","","","","","","","","",""]
[null,103,null,null,null,null,null,null,null,null,null,null,null,null,null,null,null,null,null,null,null,null,null,null,"","","","","","","","","","","","","","","","","","","","","","","","","","","","","","","","","","","","","","","","","","","","","",""]
[null,104,null,null,null,null,null,null,null,null,null,null,null,null,null,null,null,null,null,null,null,null,null,null,"","","","","","","","","","","","","","","","","","","","","","","","","","","","","","","","","","","","","","","","","","","","","",""]
[null,105,null,null,null,null,null,null,null,null,null,null,null,null,null,null,null,null,null,null,null,null,null,null,"","","","","","","","","","","","","","","","","","","","","","","","","","","","","","","","","","","","","","","","","","","","","",""]
[null,106,null,null,null,null,null,null,null,null,null,null,null,null,null,null,null,null,null,null,null,null,null,null,"","","","","","","","","","","","","","","","","","","","","","","","","","","","","","","","","","","","","","","","","","","","","",""]
[null,107,null,null,null,null,null,null,null,null,null,null,null,null,null,null,null,null,null,null,null,null,null,null,"","","","","","","","","","","","","","","","","","","","","","","","","","","","","","","","","","","","","","","","","","","","","",""]
[null,108,null,null,null,null,null,null,null,null,null,null,null,null,null,null,null,null,null,null,null,null,null,null,"","","","","","","","","","","","","","","","","","","","","","","","","","","","","","","","","","","","","","","","","","","","","",""]
[null,109,null,null,null,null,null,null,null,null,null,null,null,null,null,null,null,null,null,null,null,null,null,null,"","","","","","","","","","","","","","","","","","","","","","","","","","","","","","","","","","","","","","","","","","","","","",""]
[null,110,null,null,null,null,null,null,null,null,null,null,null,null,null,null,null,null,null,null,null,null,null,null,"","","","","","","","","","","","","","","","","","","","","","","","","","","","","","","","","","","","","","","","","","","","","",""]
[null,111,null,null,null,null,null,null,null,null,null,null,null,null,null,null,null,null,null,null,null,null,null,null,"","","","","","","","","","","","","","","","","","","","","","","","","","","","","","","","","","","","","","","","","","","","","",""]
[null,112,null,null,null,null,null,null,null,null,null,null,null,null,null,null,null,null,null,null,null,null,null,null,"","","","","","","","","","","","","","","","","","","","","","","","","","","","","","","","","","","","","","","","","","","","","",""]
[null,113,null,null,null,null,null,null,null,null,null,null,null,null,null,null,null,null,null,null,null,null,null,null,"","","","","","","","","","","","","","","","","","","","","","","","","","","","","","","","","","","","","","","","","","","","","",""]
[null,114,null,null,null,null,null,null,null,null,null,null,null,null,null,null,null,null,null,null,null,null,null,null,"","","","","","","","","","","","","","","","","","","","","","","","","","","","","","","","","","","","","","","","","","","","","",""]
[null,115,null,null,null,null,null,null,null,null,null,null,null,null,null,null,null,null,null,null,null,null,null,null,"","","","","","","","","","","","","","","","","","","","","","","","","","","","","","","","","","","","","","","","","","","","","",""]
[null,116,null,null,null,null,null,null,null,null,null,null,null,null,null,null,null,null,null,null,null,null,null,null,"","","","","","","","","","","","","","","","","","","","","","","","","","","","","","","","","","","","","","","","","","","","","",""]
[null,117,null,null,null,null,null,null,null,null,null,null,null,null,null,null,null,null,null,null,null,null,null,null,"","","","","","","","","","","","","","","","","","","","","","","","","","","","","","","","","","","","","","","","","","","","","",""]
[null,118,null,null,null,null,null,null,null,null,null,null,null,null,null,null,null,null,null,null,null,null,null,null,"","","","","","","","","","","","","","","","","","","","","","","","","","","","","","","","","","","","","","","","","","","","","",""]
[null,119,null,null,null,null,null,null,null,null,null,null,null,null,null,null,null,null,null,null,null,null,null,null,"","","","","","","","","","","","","","","","","","","","","","","","","","","","","","","","","","","","","","","","","","","","","",""]
[null,120,null,null,null,null,null,null,null,null,null,null,null,null,null,null,null,null,null,null,null,null,null,null,"","","","","","","","","","","","","","","","","","","","","","","","","","","","","","","","","","","","","","","","","","","","","",""]
[null,121,null,null,null,null,null,null,null,null,null,null,null,null,null,null,null,null,null,null,null,null,null,null,"","","","","","","","","","","","","","","","","","","","","","","","","","","","","","","","","","","","","","","","","","","","","",""]
[null,122,null,null,null,null,null,null,null,null,null,null,null,null,null,null,null,null,null,null,null,null,null,null,"","","","","","","","","","","","","","","","","","","","","","","","","","","","","","","","","","","","","","","","","","","","","",""]
[null,123,null,null,null,null,null,null,null,null,null,null,null,null,null,null,null,null,null,null,null,null,null,null,"","","","","","","","","","","","","","","","","","","","","","","","","","","","","","","","","","","","","","","","","","","","","",""]
[null,124,null,null,null,null,null,null,null,null,null,null,null,null,null,null,null,null,null,null,null,null,null,null,"","","","","","","","","","","","","","","","","","","","","","","","","","","","","","","","","","","","","","","","","","","","","",""]
[null,125,null,null,null,null,null,null,null,null,null,null,null,null,null,null,null,null,null,null,null,null,null,null,"","","","","","","","","","","","","","","","","","","","","","","","","","","","","","","","","","","","","","","","","","","","","",""]
[null,126,null,null,null,null,null,null,null,null,null,null,null,null,null,null,null,null,null,null,null,null,null,null,"","","","","","","","","","","","","","","","","","","","","","","","","","","","","","","","","","","","","","","","","","","","","",""]
[null,127,null,null,null,null,null,null,null,null,null,null,null,null,null,null,null,null,null,null,null,null,null,null,"","","","","","","","","","","","","","","","","","","","","","","","","","","","","","","","","","","","","","","","","","","","","",""]
[null,128,null,null,null,null,null,null,null,null,null,null,null,null,null,null,null,null,null,null,null,null,null,null,"","","","","","","","","","","","","","","","","","","","","","","","","","","","","","","","","","","","","","","","","","","","","",""]
[null,129,null,null,null,null,null,null,null,null,null,null,null,null,null,null,null,null,null,null,null,null,null,null,"",{"$f":"IF(F136=\"\",\"\",CONCATENATE($V$7,\".\",F136))","v":""},{"$f":"IF(H136=\"\",\"\",IF(H136=\"BYTE\",\"Integer\",IF(H136=\"WORD\",\"UINT\",IF(H136=\"DWORD\",\"UDINT\",H136))))","v":""},"","",{"$f":"IF(F136=\"\",\"\",CONCATENATE(R136))","v":""},"","","","","","","","","","","","","","","","","","","","",{"$f":"IF(AA137=\"\",\"\",CONCATENATE(\"%MW\",E136))","v":""},"","","","","","","","","","","","","","","","","","",""]
[null,130,null,null,null,null,null,null,null,null,null,null,null,null,null,null,null,null,null,null,null,null,null,null,{"$f":"IF(IFERROR(Z138,\"\")=\"\",\"\",\"Variable\")","v":""},"","",{"$f":"IF(AA138=\"\",\"\",$V$8)","v":""},{"$f":"IF(AA138=\"\",\"\",$V$13)","v":""},"",{"$f":"IF(AA138=\"\",\"\",J137)","v":""},{"$f":"IF(AA138=\"\",\"\",IF(AA138=\"BOOL\",\"\", IF(AA138=\"INT\",\"\",IF(AA138=\"DINT\",\"\",IF(AA138=\"UINT\",\"\",IF(AA138=\"REAL\",\"\",IF(AA138=\"Integer\",\"\",IF(AA138=\"UDINT\",\"\",\"\")))))) ))","v":""},{"$f":"IF(AA138=\"\",\"\",$V$9)","v":""},{"$f":"IF(AA138=\"\",\"\",$V$10)","v":""},{"$f":"IF(AA138=\"\",\"\",$V$11)","v":""},{"$f":"IF(AA138=\"\",\"\",IF(AA138=\"BOOL\",\"\", IF(AA138=\"INT\",\"\",IF(AA138=\"DINT\",\"\",IF(AA138=\"UINT\",\"\",IF(AA138=\"REAL\",\"\",IF(AA138=\"Integer\",\"\",IF(AA138=\"UDINT\",\"\",\"\")))))) ))","v":""},{"$f":"IF(AA138=\"\",\"\",IF(AA138=\"BOOL\",\"\", IF(AA138=\"INT\",\"\",IF(AA138=\"DINT\",\"\",IF(AA138=\"UINT\",\"\",IF(AA138=\"REAL\",\"\",IF(AA138=\"Integer\",\"\",IF(AA138=\"UDINT\",\"\",\"\")))))) ))","v":""},{"$f":"IF(AA138=\"\",\"\",IF(AA138=\"BOOL\",\"\", IF(AA138=\"INT\",\"\",IF(AA138=\"DINT\",\"\",IF(AA138=\"UINT\",\"\",IF(AA138=\"REAL\",\"\",IF(AA138=\"Integer\",\"\",IF(AA138=\"UDINT\",\"\",\"\")))))) ))","v":""},{"$f":"IF(AA138=\"\",\"\",IF(AA138=\"BOOL\",\"\", IF(AA138=\"INT\",\"\",IF(AA138=\"DINT\",\"\",IF(AA138=\"UINT\",\"\",IF(AA138=\"REAL\",\"\",IF(AA138=\"Integer\",\"\",IF(AA138=\"UDINT\",\"\",\"\")))))) ))","v":""},{"$f":"IF(AA138=\"\",\"\",IF(AA138=\"BOOL\",\"\", IF(AA138=\"INT\",\"\",IF(AA138=\"DINT\",\"\",IF(AA138=\"UINT\",\"\",IF(AA138=\"REAL\",\"\",IF(AA138=\"Integer\",\"\",IF(AA138=\"UDINT\",\"\",\"\")))))) ))","v":""},{"$f":"IF(AA138=\"\",\"\",IF(AA138=\"BOOL\",\"\", IF(AA138=\"INT\",\"\",IF(AA138=\"DINT\",\"\",IF(AA138=\"UINT\",\"\",IF(AA138=\"REAL\",\"\",IF(AA138=\"Integer\",\"\",IF(AA138=\"UDINT\",\"\",\"\")))))) ))","v":""},{"$f":"IF(AA138=\"\",\"\",IF(AA138=\"BOOL\",\"\", IF(AA138=\"INT\",\"\",IF(AA138=\"DINT\",\"\",IF(AA138=\"UINT\",\"\",IF(AA138=\"REAL\",\"\",IF(AA138=\"Integer\",\"\",IF(AA138=\"UDINT\",\"\",\"\")))))) ))","v":""},{"$f":"IF(AA138=\"\",\"\",IF(AA138=\"BOOL\",\"\", IF(AA138=\"INT\",\"\",IF(AA138=\"DINT\",\"\",IF(AA138=\"UINT\",\"\",IF(AA138=\"REAL\",\"\",IF(AA138=\"Integer\",\"\",IF(AA138=\"UDINT\",\"\",\"\")))))) ))","v":""},{"$f":"IF(AA138=\"\",\"\",IF(AA138=\"BOOL\",\"\", IF(AA138=\"INT\",\"\",IF(AA138=\"DINT\",\"\",IF(AA138=\"UINT\",\"\",IF(AA138=\"REAL\",\"\",IF(AA138=\"Integer\",\"\",IF(AA138=\"UDINT\",\"\",\"\")))))) ))","v":""},{"$f":"IF(AA138=\"\",\"\",IF(AA138=\"BOOL\",\"\", IF(AA138=\"INT\",\"\",IF(AA138=\"DINT\",\"\",IF(AA138=\"UINT\",\"\",IF(AA138=\"REAL\",\"\",IF(AA138=\"Integer\",\"\",IF(AA138=\"UDINT\",\"\",\"\")))))) ))","v":""},{"$f":"IF(AA138=\"\",\"\",IF(AA138=\"BOOL\",\"\", IF(AA138=\"INT\",\"\",IF(AA138=\"DINT\",\"\",IF(AA138=\"UINT\",\"\",IF(AA138=\"REAL\",\"\",IF(AA138=\"Integer\",\"\",IF(AA138=\"UDINT\",\"\",\"\")))))) ))","v":""},{"$f":"IF(AA138=\"\",\"\",IF(AA138=\"BOOL\",\"\", IF(AA138=\"INT\",\"\",IF(AA138=\"DINT\",\"\",IF(AA138=\"UINT\",\"\",IF(AA138=\"REAL\",\"\",IF(AA138=\"Integer\",\"\",IF(AA138=\"UDINT\",\"\",\"\")))))) ))","v":""},{"$f":"IF(AA138=\"\",\"\",IF(AA138=\"BOOL\",\"\", IF(AA138=\"INT\",\"\",IF(AA138=\"DINT\",\"\",IF(AA138=\"UINT\",\"\",IF(AA138=\"REAL\",\"\",IF(AA138=\"Integer\",\"\",IF(AA138=\"UDINT\",\"\",\"\")))))) ))","v":""},{"$f":"IF(AA138=\"\",\"\",IF(AA138=\"BOOL\",\"\", IF(AA138=\"INT\",\"\",IF(AA138=\"DINT\",\"\",IF(AA138=\"UINT\",\"\",IF(AA138=\"REAL\",\"\",IF(AA138=\"Integer\",\"\",IF(AA138=\"UDINT\",\"\",\"\")))))) ))","v":""},{"$f":"IF(AA138=\"\",\"\",$V$12)","v":""},"",{"$f":"IF(AA138=\"\",\"\",IF( AA138=\"BOOL\",CONCATENATE(\"X\",\"0\"),\"\"))","v":""},{"$f":"IF(AA138=\"\",\"\",IF(AA138=\"BOOL\",\"\", IF(AA138=\"INT\",\"BIN\",IF(AA138=\"DINT\",\"BIN\",IF(AA138=\"UINT\",\"BIN\",IF(AA138=\"REAL\",\"\",IF(AA138=\"Integer\",\"BIN\",IF(AA138=\"UDINT\",\"BIN\",\"\")))))) ))","v":""},{"$f":"IF(AA138=\"\",\"\",IF(AA138=\"BOOL\",\"\", IF(AA138=\"INT\",\"2sComplement\",IF(AA138=\"DINT\",\"2sComplement\",IF(AA138=\"UINT\",\"Unsigned\",IF(AA138=\"REAL\",\"\",IF(AA138=\"Integer\",\"Unsigned\",IF(AA138=\"UDINT\",\"Unsigned\",\"\")))))) ))","v":""},{"$f":"IF(AA138=\"\",\"\",IF(AA138=\"BOOL\",\"\", IF(AA138=\"INT\",\"16Bits\",IF(AA138=\"DINT\",\"32Bits\",IF(AA138=\"UINT\",\"16Bits\",IF(AA138=\"REAL\",\"\",IF(AA138=\"Integer\",\"BitField\",IF(AA138=\"UDINT\",\"32Bits\",\"\")))))) ))","v":""},{"$f":"IF(AA138=\"\",\"\",IF(AA138=\"BOOL\",\"\", IF(AA138=\"INT\",\"\",IF(AA138=\"DINT\",\"\",IF(AA138=\"UINT\",\"\",IF(AA138=\"REAL\",\"\",IF(AA138=\"Integer\",\"0\",IF(AA138=\"UDINT\",\"\",\"\")))))) ))","v":""},{"$f":"IF(AA138=\"\",\"\",IF(AA138=\"BOOL\",\"\", IF(AA138=\"INT\",\"\",IF(AA138=\"DINT\",\"\",IF(AA138=\"UINT\",\"\",IF(AA138=\"REAL\",\"\",IF(AA138=\"Integer\",\"8\",IF(AA138=\"UDINT\",\"\",\"\")))))) ))","v":""},{"$f":"IF(AA138=\"\",\"\",IF(AA138=\"BOOL\",\"\", IF(AA138=\"INT\",\"Disable\",IF(AA138=\"DINT\",\"Disable\",IF(AA138=\"UINT\",\"Disable\",IF(AA138=\"REAL\",\"Disable\",IF(AA138=\"Integer\",\"Disable\",IF(AA138=\"UDINT\",\"Disable\",\"\")))))) ))","v":""},{"$f":"IF(AA138=\"\",\"\",IF(AA138=\"BOOL\",\"\", IF(AA138=\"INT\",\"\",IF(AA138=\"DINT\",\"\",IF(AA138=\"UINT\",\"\",IF(AA138=\"REAL\",\"\",IF(AA138=\"Integer\",\"\",IF(AA138=\"UDINT\",\"\",\"\")))))) ))","v":""},{"$f":"IF(AA138=\"\",\"\",IF(AA138=\"BOOL\",\"\", IF(AA138=\"INT\",\"\",IF(AA138=\"DINT\",\"\",IF(AA138=\"UINT\",\"\",IF(AA138=\"REAL\",\"\",IF(AA138=\"Integer\",\"\",IF(AA138=\"UDINT\",\"\",\"\")))))) ))","v":""},{"$f":"IF(AA138=\"\",\"\",IF(AA138=\"BOOL\",\"\", IF(AA138=\"INT\",\"Disable\",IF(AA138=\"DINT\",\"Disable\",IF(AA138=\"UINT\",\"Disable\",IF(AA138=\"REAL\",\"Disable\",IF(AA138=\"Integer\",\"Disable\",IF(AA138=\"UDINT\",\"Disable\",\"\")))))) ))","v":""},{"$f":"IF(AA138=\"\",\"\",IF(AA138=\"BOOL\",\"\", IF(AA138=\"INT\",\"\",IF(AA138=\"DINT\",\"\",IF(AA138=\"UINT\",\"\",IF(AA138=\"REAL\",\"\",IF(AA138=\"Integer\",\"\",IF(AA138=\"UDINT\",\"\",\"\")))))) ))","v":""},{"$f":"IF(AA138=\"\",\"\",IF(AA138=\"BOOL\",\"\", IF(AA138=\"INT\",\"\",IF(AA138=\"DINT\",\"\",IF(AA138=\"UINT\",\"\",IF(AA138=\"REAL\",\"\",IF(AA138=\"Integer\",\"\",IF(AA138=\"UDINT\",\"\",\"\")))))) ))","v":""},{"$f":"IF(AA138=\"\",\"\",IF(AA138=\"BOOL\",\"\", IF(AA138=\"INT\",\"\",IF(AA138=\"DINT\",\"\",IF(AA138=\"UINT\",\"\",IF(AA138=\"REAL\",\"\",IF(AA138=\"Integer\",\"\",IF(AA138=\"UDINT\",\"\",\"\")))))) ))","v":""},{"$f":"IF(AA138=\"\",\"\",IF(AA138=\"BOOL\",\"\", IF(AA138=\"INT\",\"\",IF(AA138=\"DINT\",\"\",IF(AA138=\"UINT\",\"\",IF(AA138=\"REAL\",\"\",IF(AA138=\"Integer\",\"\",IF(AA138=\"UDINT\",\"\",\"\")))))) ))","v":""},{"$f":"IF(AA138=\"\",\"\",IF(AA138=\"BOOL\",\"Disable\", IF(AA138=\"INT\",\"Disable\",IF(AA138=\"DINT\",\"Disable\",IF(AA138=\"UINT\",\"Disable\",IF(AA138=\"REAL\",\"Disable\",IF(AA138=\"Integer\",\"Disable\",IF(AA138=\"UDINT\",\"Disable\",\"\")))))) ))","v":""},{"$f":"IF(AA138=\"\",\"\",IF(AA138=\"BOOL\",\"\", IF(AA138=\"INT\",\"\",IF(AA138=\"DINT\",\"\",IF(AA138=\"UINT\",\"\",IF(AA138=\"REAL\",\"\",IF(AA138=\"Integer\",\"\",IF(AA138=\"UDINT\",\"\",\"\")))))) ))","v":""},{"$f":"IF(AA138=\"\",\"\",IF(AA138=\"BOOL\",\"\", IF(AA138=\"INT\",\"\",IF(AA138=\"DINT\",\"\",IF(AA138=\"UINT\",\"\",IF(AA138=\"REAL\",\"\",IF(AA138=\"Integer\",\"\",IF(AA138=\"UDINT\",\"\",\"\")))))) ))","v":""},{"$f":"IF(AA138=\"\",\"\",IF(AA138=\"BOOL\",\"None\", IF(AA138=\"INT\",\"None\",IF(AA138=\"DINT\",\"None\",IF(AA138=\"UINT\",\"None\",IF(AA138=\"REAL\",\"None\",IF(AA138=\"Integer\",\"None\",IF(AA138=\"UDINT\",\"None\",\"\")))))) ))","v":""},{"$f":"IF(AA138=\"\",\"\",IF(AA138=\"BOOL\",\"Disable\", IF(AA138=\"INT\",\"Disable\",IF(AA138=\"DINT\",\"Disable\",IF(AA138=\"UINT\",\"Disable\",IF(AA138=\"REAL\",\"Disable\",IF(AA138=\"Integer\",\"Disable\",IF(AA138=\"UDINT\",\"Disable\",\"\")))))) ))","v":""}]
[null,131,null,null,null,null,null,null,null,null,null,null,null,null,null,null,null,null,null,null,null,null,null,null,"","","","","","","","","","","","","","","","","","","","","","","","","","","","","","","","","","","","","","","","","","","","","",""]
[null,132,null,null,null,null,null,null,null,null,null,null,null,null,null,null,null,null,null,null,null,null,null,null,"","","","","","","","","","","","","","","","","","","","","","","","","","","","","","","","","","","","","","","","","","","","","",""]
[null,133,null,null,null,null,null,null,null,null,null,null,null,null,null,null,null,null,null,null,null,null,null,null,"","","","","","","","","","","","","","","","","","","","","","","","","","","","","","","","","","","","","","","","","","","","","",""]
[null,134,null,null,null,null,null,null,null,null,null,null,null,null,null,null,null,null,null,null,null,null,null,null,"","","","","","","","","","","","","","","","","","","","","","","","","","","","","","","","","","","","","","","","","","","","","",""]
[null,135,null,null,null,null,null,null,null,null,null,null,null,null,null,null,null,null,null,null,null,null,null,null,"","","","","","","","","","","","","","","","","","","","","","","","","","","","","","","","","","","","","","","","","","","","","",""]
[null,136,null,null,null,null,null,null,null,null,null,null,null,null,null,null,null,null,null,null,null,null,null,null,"","","","","","","","","","","","","","","","","","","","","","","","","","","","","","","","","","","","","","","","","","","","","",""]
[null,137,null,null,null,null,null,null,null,null,null,null,null,null,null,null,null,null,null,null,null,null,null,null,"","","","","","","","","","","","","","","","","","","","","","","","","","","","","","","","","","","","","","","","","","","","","",""]
[null,138,null,null,null,null,null,null,null,null,null,null,null,null,null,null,null,null,null,null,null,null,null,null,"","","","","","","","","","","","","","","","","","","","","","","","","","","","","","","","","","","","","","","","","","","","","",""]
[null,139,null,null,null,null,null,null,null,null,null,null,null,null,null,null,null,null,null,null,null,null,null,null,"","","","","","","","","","","","","","","","","","","","","","","","","","","","","","","","","","","","","","","","","","","","","",""]
[null,140,null,null,null,null,null,null,null,null,null,null,null,null,null,null,null,null,null,null,null,null,null,null,"","","","","","","","","","","","","","","","","","","","","","","","","","","","","","","","","","","","","","","","","","","","","",""]
[null,141,null,null,null,null,null,null,null,null,null,null,null,null,null,null,null,null,null,null,null,null,null,null,"","","","","","","","","","","","","","","","","","","","","","","","","","","","","","","","","","","","","","","","","","","","","",""]
[null,142,null,null,null,null,null,null,null,null,null,null,null,null,null,null,null,null,null,null,null,null,null,null,"","","","","","","","","","","","","","","","","","","","","","","","","","","","","","","","","","","","","","","","","","","","","",""]
[null,143,null,null,null,null,null,null,null,null,null,null,null,null,null,null,null,null,null,null,null,null,null,null,"","","","","","","","","","","","","","","","","","","","","","","","","","","","","","","","","","","","","","","","","","","","","",""]
[null,144,null,null,null,null,null,null,null,null,null,null,null,null,null,null,null,null,null,null,null,null,null,null,"","","","","","","","","","","","","","","","","","","","","","","","","","","","","","","","","","","","","","","","","","","","","",""]
[null,145,null,null,null,null,null,null,null,null,null,null,null,null,null,null,null,null,null,null,null,null,null,null,"","","","","","","","","","","","","","","","","","","","","","","","","","","","","","","","","","","","","","","","","","","","","",""]
[null,146,null,null,null,null,null,null,null,null,null,null,null,null,null,null,null,null,null,null,null,null,null,null,"","","","","","","","","","","","","","","","","","","","","","","","","","","","","","","","","","","","","","","","","","","","","",""]
[null,147,null,null,null,null,null,null,null,null,null,null,null,null,null,null,null,null,null,null,null,null,null,null,"","","","","","","","","","","","","","","","","","","","","","","","","","","","","","","","","","","","","","","","","","","","","",""]
[null,148,null,null,null,null,null,null,null,null,null,null,null,null,null,null,null,null,null,null,null,null,null,null,"","","","","","","","","","","","","","","","","","","","","","","","","","","","","","","","","","","","","","","","","","","","","",""]
[null,149,null,null,null,null,null,null,null,null,null,null,null,null,null,null,null,null,null,null,null,null,null,null,"","","","","","","","","","","","","","","","","","","","","","","","","","","","","","","","","","","","","","","","","","","","","",""]
[null,150,null,null,null,null,null,null,null,null,null,null,null,null,null,null,null,null,null,null,null,null,null,null,"","","","","","","","","","","","","","","","","","","","","","","","","","","","","","","","","","","","","","","","","","","","","",""]
[null,151,null,null,null,null,null,null,null,null,null,null,null,null,null,null,null,null,null,null,null,null,null,null,"","","","","","","","","","","","","","","","","","","","","","","","","","","","","","","","","","","","","","","","","","","","","",""]
[null,152,null,null,null,null,null,null,null,null,null,null,null,null,null,null,null,null,null,null,null,null,null,null,"","","","","","","","","","","","","","","","","","","","","","","","","","","","","","","","","","","","","","","","","","","","","",""]
[null,153,null,null,null,null,null,null,null,null,null,null,null,null,null,null,null,null,null,null,null,null,null,null,"","","","","","","","","","","","","","","","","","","","","","","","","","","","","","","","","","","","","","","","","","","","","",""]
[null,154,null,null,null,null,null,null,null,null,null,null,null,null,null,null,null,null,null,null,null,null,null,null,"","","","","","","","","","","","","","","","","","","","","","","","","","","","","","","","","","","","","","","","","","","","","",""]
[null,155,null,null,null,null,null,null,null,null,null,null,null,null,null,null,null,null,null,null,null,null,null,null,"","","","","","","","","","","","","","","","","","","","","","","","","","","","","","","","","","","","","","","","","","","","","",""]
[null,156,null,null,null,null,null,null,null,null,null,null,null,null,null,null,null,null,null,null,null,null,null,null,"","","","","","","","","","","","","","","","","","","","","","","","","","","","","","","","","","","","","","","","","","","","","",""]
[null,157,null,null,null,null,null,null,null,null,null,null,null,null,null,null,null,null,null,null,null,null,null,null,"","","","","","","","","","","","","","","","","","","","","","","","","","","","","","","","","","","","","","","","","","","","","",""]
[null,158,null,null,null,null,null,null,null,null,null,null,null,null,null,null,null,null,null,null,null,null,null,null,"","","","","","","","","","","","","","","","","","","","","","","","","","","","","","","","","","","","","","","","","","","","","",""]
[null,159,null,null,null,null,null,null,null,null,null,null,null,null,null,null,null,null,null,null,null,null,null,null,"","","","","","","","","","","","","","","","","","","","","","","","","","","","","","","","","","","","","","","","","","","","","",""]
[null,160,null,null,null,null,null,null,null,null,null,null,null,null,null,null,null,null,null,null,null,null,null,null,"","","","","","","","","","","","","","","","","","","","","","","","","","","","","","","","","","","","","","","","","","","","","",""]
[null,161,null,null,null,null,null,null,null,null,null,null,null,null,null,null,null,null,null,null,null,null,null,null,"","","","","","","","","","","","","","","","","","","","","","","","","","","","","","","","","","","","","","","","","","","","","",""]
[null,162,null,null,null,null,null,null,null,null,null,null,null,null,null,null,null,null,null,null,null,null,null,null,"","","","","","","","","","","","","","","","","","","","","","","","","","","","","","","","","","","","","","","","","","","","","",""]
[null,163,null,null,null,null,null,null,null,null,null,null,null,null,null,null,null,null,null,null,null,null,null,null,"","","","","","","","","","","","","","","","","","","","","","","","","","","","","","","","","","","","","","","","","","","","","",""]
[null,164,null,null,null,null,null,null,null,null,null,null,null,null,null,null,null,null,null,null,null,null,null,null,"","","","","","","","","","","","","","","","","","","","","","","","","","","","","","","","","","","","","","","","","","","","","",""]
[null,165,null,null,null,null,null,null,null,null,null,null,null,null,null,null,null,null,null,null,null,null,null,null,"","","","","","","","","","","","","","","","","","","","","","","","","","","","","","","","","","","","","","","","","","","","","",""]
[null,166,null,null,null,null,null,null,null,null,null,null,null,null,null,null,null,null,null,null,null,null,null,null,"","","","","","","","","","","","","","","","","","","","","","","","","","","","","","","","","","","","","","","","","","","","","",""]
[null,167,null,null,null,null,null,null,null,null,null,null,null,null,null,null,null,null,null,null,null,null,null,null,"","","","","","","","","","","","","","","","","","","","","","","","","","","","","","","","","","","","","","","","","","","","","",""]
[null,168,null,null,null,null,null,null,null,null,null,null,null,null,null,null,null,null,null,null,null,null,null,null,"","","","","","","","","","","","","","","","","","","","","","","","","","","","","","","","","","","","","","","","","","","","","",""]
[null,169,null,null,null,null,null,null,null,null,null,null,null,null,null,null,null,null,null,null,null,null,null,null,"","","","","","","","","","","","","","","","","","","","","","","","","","","","","","","","","","","","","","","","","","","","","",""]
[null,170,null,null,null,null,null,null,null,null,null,null,null,null,null,null,null,null,null,null,null,null,null,null,"","","","","","","","","","","","","","","","","","","","","","","","","","","","","","","","","","","","","","","","","","","","","",""]
[null,171,null,null,null,null,null,null,null,null,null,null,null,null,null,null,null,null,null,null,null,null,null,null,"","","","","","","","","","","","","","","","","","","","","","","","","","","","","","","","","","","","","","","","","","","","","",""]
[null,172,null,null,null,null,null,null,null,null,null,null,null,null,null,null,null,null,null,null,null,null,null,null,"","","","","","","","","","","","","","","","","","","","","","","","","","","","","","","","","","","","","","","","","","","","","",""]
[null,173,null,null,null,null,null,null,null,null,null,null,null,null,null,null,null,null,null,null,null,null,null,null,"","","","","","","","","","","","","","","","","","","","","","","","","","","","","","","","","","","","","","","","","","","","","",""]
[null,174,null,null,null,null,null,null,null,null,null,null,null,null,null,null,null,null,null,null,null,null,null,null,"","","","","","","","","","","","","","","","","","","","","","","","","","","","","","","","","","","","","","","","","","","","","",""]
[null,175,null,null,null,null,null,null,null,null,null,null,null,null,null,null,null,null,null,null,null,null,null,null,"","","","","","","","","","","","","","","","","","","","","","","","","","","","","","","","","","","","","","","","","","","","","",""]
[null,176,null,null,null,null,null,null,null,null,null,null,null,null,null,null,null,null,null,null,null,null,null,null,"","","","","","","","","","","","","","","","","","","","","","","","","","","","","","","","","","","","","","","","","","","","","",""]
[null,177,null,null,null,null,null,null,null,null,null,null,null,null,null,null,null,null,null,null,null,null,null,null,"","","","","","","","","","","","","","","","","","","","","","","","","","","","","","","","","","","","","","","","","","","","","",""]
[null,178,null,null,null,null,null,null,null,null,null,null,null,null,null,null,null,null,null,null,null,null,null,null,"","","","","","","","","","","","","","","","","","","","","","","","","","","","","","","","","","","","","","","","","","","","","",""]
[null,179,null,null,null,null,null,null,null,null,null,null,null,null,null,null,null,null,null,null,null,null,null,null,"","","","","","","","","","","","","","","","","","","","","","","","","","","","","","","","","","","","","","","","","","","","","",""]
[null,180,null,null,null,null,null,null,null,null,null,null,null,null,null,null,null,null,null,null,null,null,null,null,"","","","","","","","","","","","","","","","","","","","","","","","","","","","","","","","","","","","","","","","","","","","","",""]
[null,181,null,null,null,null,null,null,null,null,null,null,null,null,null,null,null,null,null,null,null,null,null,null,"","","","","","","","","","","","","","","","","","","","","","","","","","","","","","","","","","","","","","","","","","","","","",""]
[null,182,null,null,null,null,null,null,null,null,null,null,null,null,null,null,null,null,null,null,null,null,null,null,"","","","","","","","","","","","","","","","","","","","","","","","","","","","","","","","","","","","","","","","","","","","","",""]
[null,183,null,null,null,null,null,null,null,null,null,null,null,null,null,null,null,null,null,null,null,null,null,null,"","","","","","","","","","","","","","","","","","","","","","","","","","","","","","","","","","","","","","","","","","","","","",""]
[null,184,null,null,null,null,null,null,null,null,null,null,null,null,null,null,null,null,null,null,null,null,null,null,"","","","","","","","","","","","","","","","","","","","","","","","","","","","","","","","","","","","","","","","","","","","","",""]
[null,185,null,null,null,null,null,null,null,null,null,null,null,null,null,null,null,null,null,null,null,null,null,null,"","","","","","","","","","","","","","","","","","","","","","","","","","","","","","","","","","","","","","","","","","","","","",""]
[null,186,null,null,null,null,null,null,null,null,null,null,null,null,null,null,null,null,null,null,null,null,null,null,"","","","","","","","","","","","","","","","","","","","","","","","","","","","","","","","","","","","","","","","","","","","","",""]
[null,187,null,null,null,null,null,null,null,null,null,null,null,null,null,null,null,null,null,null,null,null,null,null,"","","","","","","","","","","","","","","","","","","","","","","","","","","","","","","","","","","","","","","","","","","","","",""]
[null,188,null,null,null,null,null,null,null,null,null,null,null,null,null,null,null,null,null,null,null,null,null,null,"","","","","","","","","","","","","","","","","","","","","","","","","","","","","","","","","","","","","","","","","","","","","",""]
[null,189,null,null,null,null,null,null,null,null,null,null,null,null,null,null,null,null,null,null,null,null,null,null,"","","","","","","","","","","","","","","","","","","","","","","","","","","","","","","","","","","","","","","","","","","","","",""]
[null,190,null,null,null,null,null,null,null,null,null,null,null,null,null,null,null,null,null,null,null,null,null,null,"","","","","","","","","","","","","","","","","","","","","","","","","","","","","","","","","","","","","","","","","","","","","",""]
[null,191,null,null,null,null,null,null,null,null,null,null,null,null,null,null,null,null,null,null,null,null,null,null,"","","","","","","","","","","","","","","","","","","","","","","","","","","","","","","","","","","","","","","","","","","","","",""]
[null,192,null,null,null,null,null,null,null,null,null,null,null,null,null,null,null,null,null,null,null,null,null,null,"","","","","","","","","","","","","","","","","","","","","","","","","","","","","","","","","","","","","","","","","","","","","",""]
[null,193,null,null,null,null,null,null,null,null,null,null,null,null,null,null,null,null,null,null,null,null,null,null,"",{"$f":"IF(F200=\"\",\"\",CONCATENATE($V$7,\".\",F200))","v":""},{"$f":"IF(H200=\"\",\"\",IF(H200=\"BYTE\",\"Integer\",IF(H200=\"WORD\",\"UINT\",IF(H200=\"DWORD\",\"UDINT\",H200))))","v":""},"","",{"$f":"IF(F200=\"\",\"\",CONCATENATE(R200))","v":""},"","","","","","","","","","","","","","","","","","","","",{"$f":"IF(AA201=\"\",\"\",CONCATENATE(\"%MW\",E200))","v":""},"","","","","","","","","","","","","","","","","","",""]
[null,194,null,null,null,null,null,null,null,null,null,null,null,null,null,null,null,null,null,null,null,null,null,null,{"$f":"IF(IFERROR(Z202,\"\")=\"\",\"\",\"Variable\")","v":""},"","",{"$f":"IF(AA202=\"\",\"\",$V$8)","v":""},{"$f":"IF(AA202=\"\",\"\",$V$13)","v":""},"",{"$f":"IF(AA202=\"\",\"\",J201)","v":""},{"$f":"IF(AA202=\"\",\"\",IF(AA202=\"BOOL\",\"\", IF(AA202=\"INT\",\"\",IF(AA202=\"DINT\",\"\",IF(AA202=\"UINT\",\"\",IF(AA202=\"REAL\",\"\",IF(AA202=\"Integer\",\"\",IF(AA202=\"UDINT\",\"\",\"\")))))) ))","v":""},{"$f":"IF(AA202=\"\",\"\",$V$9)","v":""},{"$f":"IF(AA202=\"\",\"\",$V$10)","v":""},{"$f":"IF(AA202=\"\",\"\",$V$11)","v":""},{"$f":"IF(AA202=\"\",\"\",IF(AA202=\"BOOL\",\"\", IF(AA202=\"INT\",\"\",IF(AA202=\"DINT\",\"\",IF(AA202=\"UINT\",\"\",IF(AA202=\"REAL\",\"\",IF(AA202=\"Integer\",\"\",IF(AA202=\"UDINT\",\"\",\"\")))))) ))","v":""},{"$f":"IF(AA202=\"\",\"\",IF(AA202=\"BOOL\",\"\", IF(AA202=\"INT\",\"\",IF(AA202=\"DINT\",\"\",IF(AA202=\"UINT\",\"\",IF(AA202=\"REAL\",\"\",IF(AA202=\"Integer\",\"\",IF(AA202=\"UDINT\",\"\",\"\")))))) ))","v":""},{"$f":"IF(AA202=\"\",\"\",IF(AA202=\"BOOL\",\"\", IF(AA202=\"INT\",\"\",IF(AA202=\"DINT\",\"\",IF(AA202=\"UINT\",\"\",IF(AA202=\"REAL\",\"\",IF(AA202=\"Integer\",\"\",IF(AA202=\"UDINT\",\"\",\"\")))))) ))","v":""},{"$f":"IF(AA202=\"\",\"\",IF(AA202=\"BOOL\",\"\", IF(AA202=\"INT\",\"\",IF(AA202=\"DINT\",\"\",IF(AA202=\"UINT\",\"\",IF(AA202=\"REAL\",\"\",IF(AA202=\"Integer\",\"\",IF(AA202=\"UDINT\",\"\",\"\")))))) ))","v":""},{"$f":"IF(AA202=\"\",\"\",IF(AA202=\"BOOL\",\"\", IF(AA202=\"INT\",\"\",IF(AA202=\"DINT\",\"\",IF(AA202=\"UINT\",\"\",IF(AA202=\"REAL\",\"\",IF(AA202=\"Integer\",\"\",IF(AA202=\"UDINT\",\"\",\"\")))))) ))","v":""},{"$f":"IF(AA202=\"\",\"\",IF(AA202=\"BOOL\",\"\", IF(AA202=\"INT\",\"\",IF(AA202=\"DINT\",\"\",IF(AA202=\"UINT\",\"\",IF(AA202=\"REAL\",\"\",IF(AA202=\"Integer\",\"\",IF(AA202=\"UDINT\",\"\",\"\")))))) ))","v":""},{"$f":"IF(AA202=\"\",\"\",IF(AA202=\"BOOL\",\"\", IF(AA202=\"INT\",\"\",IF(AA202=\"DINT\",\"\",IF(AA202=\"UINT\",\"\",IF(AA202=\"REAL\",\"\",IF(AA202=\"Integer\",\"\",IF(AA202=\"UDINT\",\"\",\"\")))))) ))","v":""},{"$f":"IF(AA202=\"\",\"\",IF(AA202=\"BOOL\",\"\", IF(AA202=\"INT\",\"\",IF(AA202=\"DINT\",\"\",IF(AA202=\"UINT\",\"\",IF(AA202=\"REAL\",\"\",IF(AA202=\"Integer\",\"\",IF(AA202=\"UDINT\",\"\",\"\")))))) ))","v":""},{"$f":"IF(AA202=\"\",\"\",IF(AA202=\"BOOL\",\"\", IF(AA202=\"INT\",\"\",IF(AA202=\"DINT\",\"\",IF(AA202=\"UINT\",\"\",IF(AA202=\"REAL\",\"\",IF(AA202=\"Integer\",\"\",IF(AA202=\"UDINT\",\"\",\"\")))))) ))","v":""},{"$f":"IF(AA202=\"\",\"\",IF(AA202=\"BOOL\",\"\", IF(AA202=\"INT\",\"\",IF(AA202=\"DINT\",\"\",IF(AA202=\"UINT\",\"\",IF(AA202=\"REAL\",\"\",IF(AA202=\"Integer\",\"\",IF(AA202=\"UDINT\",\"\",\"\")))))) ))","v":""},{"$f":"IF(AA202=\"\",\"\",IF(AA202=\"BOOL\",\"\", IF(AA202=\"INT\",\"\",IF(AA202=\"DINT\",\"\",IF(AA202=\"UINT\",\"\",IF(AA202=\"REAL\",\"\",IF(AA202=\"Integer\",\"\",IF(AA202=\"UDINT\",\"\",\"\")))))) ))","v":""},{"$f":"IF(AA202=\"\",\"\",IF(AA202=\"BOOL\",\"\", IF(AA202=\"INT\",\"\",IF(AA202=\"DINT\",\"\",IF(AA202=\"UINT\",\"\",IF(AA202=\"REAL\",\"\",IF(AA202=\"Integer\",\"\",IF(AA202=\"UDINT\",\"\",\"\")))))) ))","v":""},{"$f":"IF(AA202=\"\",\"\",IF(AA202=\"BOOL\",\"\", IF(AA202=\"INT\",\"\",IF(AA202=\"DINT\",\"\",IF(AA202=\"UINT\",\"\",IF(AA202=\"REAL\",\"\",IF(AA202=\"Integer\",\"\",IF(AA202=\"UDINT\",\"\",\"\")))))) ))","v":""},{"$f":"IF(AA202=\"\",\"\",IF(AA202=\"BOOL\",\"\", IF(AA202=\"INT\",\"\",IF(AA202=\"DINT\",\"\",IF(AA202=\"UINT\",\"\",IF(AA202=\"REAL\",\"\",IF(AA202=\"Integer\",\"\",IF(AA202=\"UDINT\",\"\",\"\")))))) ))","v":""},{"$f":"IF(AA202=\"\",\"\",$V$12)","v":""},"",{"$f":"IF(AA202=\"\",\"\",IF( AA202=\"BOOL\",CONCATENATE(\"X\",\"0\"),\"\"))","v":""},{"$f":"IF(AA202=\"\",\"\",IF(AA202=\"BOOL\",\"\", IF(AA202=\"INT\",\"BIN\",IF(AA202=\"DINT\",\"BIN\",IF(AA202=\"UINT\",\"BIN\",IF(AA202=\"REAL\",\"\",IF(AA202=\"Integer\",\"BIN\",IF(AA202=\"UDINT\",\"BIN\",\"\")))))) ))","v":""},{"$f":"IF(AA202=\"\",\"\",IF(AA202=\"BOOL\",\"\", IF(AA202=\"INT\",\"2sComplement\",IF(AA202=\"DINT\",\"2sComplement\",IF(AA202=\"UINT\",\"Unsigned\",IF(AA202=\"REAL\",\"\",IF(AA202=\"Integer\",\"Unsigned\",IF(AA202=\"UDINT\",\"Unsigned\",\"\")))))) ))","v":""},{"$f":"IF(AA202=\"\",\"\",IF(AA202=\"BOOL\",\"\", IF(AA202=\"INT\",\"16Bits\",IF(AA202=\"DINT\",\"32Bits\",IF(AA202=\"UINT\",\"16Bits\",IF(AA202=\"REAL\",\"\",IF(AA202=\"Integer\",\"BitField\",IF(AA202=\"UDINT\",\"32Bits\",\"\")))))) ))","v":""},{"$f":"IF(AA202=\"\",\"\",IF(AA202=\"BOOL\",\"\", IF(AA202=\"INT\",\"\",IF(AA202=\"DINT\",\"\",IF(AA202=\"UINT\",\"\",IF(AA202=\"REAL\",\"\",IF(AA202=\"Integer\",\"0\",IF(AA202=\"UDINT\",\"\",\"\")))))) ))","v":""},{"$f":"IF(AA202=\"\",\"\",IF(AA202=\"BOOL\",\"\", IF(AA202=\"INT\",\"\",IF(AA202=\"DINT\",\"\",IF(AA202=\"UINT\",\"\",IF(AA202=\"REAL\",\"\",IF(AA202=\"Integer\",\"8\",IF(AA202=\"UDINT\",\"\",\"\")))))) ))","v":""},{"$f":"IF(AA202=\"\",\"\",IF(AA202=\"BOOL\",\"\", IF(AA202=\"INT\",\"Disable\",IF(AA202=\"DINT\",\"Disable\",IF(AA202=\"UINT\",\"Disable\",IF(AA202=\"REAL\",\"Disable\",IF(AA202=\"Integer\",\"Disable\",IF(AA202=\"UDINT\",\"Disable\",\"\")))))) ))","v":""},{"$f":"IF(AA202=\"\",\"\",IF(AA202=\"BOOL\",\"\", IF(AA202=\"INT\",\"\",IF(AA202=\"DINT\",\"\",IF(AA202=\"UINT\",\"\",IF(AA202=\"REAL\",\"\",IF(AA202=\"Integer\",\"\",IF(AA202=\"UDINT\",\"\",\"\")))))) ))","v":""},{"$f":"IF(AA202=\"\",\"\",IF(AA202=\"BOOL\",\"\", IF(AA202=\"INT\",\"\",IF(AA202=\"DINT\",\"\",IF(AA202=\"UINT\",\"\",IF(AA202=\"REAL\",\"\",IF(AA202=\"Integer\",\"\",IF(AA202=\"UDINT\",\"\",\"\")))))) ))","v":""},{"$f":"IF(AA202=\"\",\"\",IF(AA202=\"BOOL\",\"\", IF(AA202=\"INT\",\"Disable\",IF(AA202=\"DINT\",\"Disable\",IF(AA202=\"UINT\",\"Disable\",IF(AA202=\"REAL\",\"Disable\",IF(AA202=\"Integer\",\"Disable\",IF(AA202=\"UDINT\",\"Disable\",\"\")))))) ))","v":""},{"$f":"IF(AA202=\"\",\"\",IF(AA202=\"BOOL\",\"\", IF(AA202=\"INT\",\"\",IF(AA202=\"DINT\",\"\",IF(AA202=\"UINT\",\"\",IF(AA202=\"REAL\",\"\",IF(AA202=\"Integer\",\"\",IF(AA202=\"UDINT\",\"\",\"\")))))) ))","v":""},{"$f":"IF(AA202=\"\",\"\",IF(AA202=\"BOOL\",\"\", IF(AA202=\"INT\",\"\",IF(AA202=\"DINT\",\"\",IF(AA202=\"UINT\",\"\",IF(AA202=\"REAL\",\"\",IF(AA202=\"Integer\",\"\",IF(AA202=\"UDINT\",\"\",\"\")))))) ))","v":""},{"$f":"IF(AA202=\"\",\"\",IF(AA202=\"BOOL\",\"\", IF(AA202=\"INT\",\"\",IF(AA202=\"DINT\",\"\",IF(AA202=\"UINT\",\"\",IF(AA202=\"REAL\",\"\",IF(AA202=\"Integer\",\"\",IF(AA202=\"UDINT\",\"\",\"\")))))) ))","v":""},{"$f":"IF(AA202=\"\",\"\",IF(AA202=\"BOOL\",\"\", IF(AA202=\"INT\",\"\",IF(AA202=\"DINT\",\"\",IF(AA202=\"UINT\",\"\",IF(AA202=\"REAL\",\"\",IF(AA202=\"Integer\",\"\",IF(AA202=\"UDINT\",\"\",\"\")))))) ))","v":""},{"$f":"IF(AA202=\"\",\"\",IF(AA202=\"BOOL\",\"Disable\", IF(AA202=\"INT\",\"Disable\",IF(AA202=\"DINT\",\"Disable\",IF(AA202=\"UINT\",\"Disable\",IF(AA202=\"REAL\",\"Disable\",IF(AA202=\"Integer\",\"Disable\",IF(AA202=\"UDINT\",\"Disable\",\"\")))))) ))","v":""},{"$f":"IF(AA202=\"\",\"\",IF(AA202=\"BOOL\",\"\", IF(AA202=\"INT\",\"\",IF(AA202=\"DINT\",\"\",IF(AA202=\"UINT\",\"\",IF(AA202=\"REAL\",\"\",IF(AA202=\"Integer\",\"\",IF(AA202=\"UDINT\",\"\",\"\")))))) ))","v":""},{"$f":"IF(AA202=\"\",\"\",IF(AA202=\"BOOL\",\"\", IF(AA202=\"INT\",\"\",IF(AA202=\"DINT\",\"\",IF(AA202=\"UINT\",\"\",IF(AA202=\"REAL\",\"\",IF(AA202=\"Integer\",\"\",IF(AA202=\"UDINT\",\"\",\"\")))))) ))","v":""},{"$f":"IF(AA202=\"\",\"\",IF(AA202=\"BOOL\",\"None\", IF(AA202=\"INT\",\"None\",IF(AA202=\"DINT\",\"None\",IF(AA202=\"UINT\",\"None\",IF(AA202=\"REAL\",\"None\",IF(AA202=\"Integer\",\"None\",IF(AA202=\"UDINT\",\"None\",\"\")))))) ))","v":""},{"$f":"IF(AA202=\"\",\"\",IF(AA202=\"BOOL\",\"Disable\", IF(AA202=\"INT\",\"Disable\",IF(AA202=\"DINT\",\"Disable\",IF(AA202=\"UINT\",\"Disable\",IF(AA202=\"REAL\",\"Disable\",IF(AA202=\"Integer\",\"Disable\",IF(AA202=\"UDINT\",\"Disable\",\"\")))))) ))","v":""}]
[null,195,null,null,null,null,null,null,null,null,null,null,null,null,null,null,null,null,null,null,null,null,null,null,"","","","","","","","","","","","","","","","","","","","","","","","","","","","","","","","","","","","","","","","","","","","","",""]
[null,196,null,null,null,null,null,null,null,null,null,null,null,null,null,null,null,null,null,null,null,null,null,null,"","","","","","","","","","","","","","","","","","","","","","","","","","","","","","","","","","","","","","","","","","","","","",""]
[null,197,null,null,null,null,null,null,null,null,null,null,null,null,null,null,null,null,null,null,null,null,null,null,"","","","","","","","","","","","","","","","","","","","","","","","","","","","","","","","","","","","","","","","","","","","","",""]
[null,198,null,null,null,null,null,null,null,null,null,null,null,null,null,null,null,null,null,null,null,null,null,null,"","","","","","","","","","","","","","","","","","","","","","","","","","","","","","","","","","","","","","","","","","","","","",""]
[null,199,null,null,null,null,null,null,null,null,null,null,null,null,null,null,null,null,null,null,null,null,null,null,"","","","","","","","","","","","","","","","","","","","","","","","","","","","","","","","","","","","","","","","","","","","","",""]
[null,200,null,null,null,null,null,null,null,null,null,null,null,null,null,null,null,null,null,null,null,null,null,null,"","","","","","","","","","","","","","","","","","","","","","","","","","","","","","","","","","","","","","","","","","","","","",""]
[null,201,null,null,null,null,null,null,null,null,null,null,null,null,null,null,null,null,null,null,null,null,null,null,"","","","","","","","","","","","","","","","","","","","","","","","","","","","","","","","","","","","","","","","","","","","","",""]
[null,202,null,null,null,null,null,null,null,null,null,null,null,null,null,null,null,null,null,null,null,null,null,null,"","","","","","","","","","","","","","","","","","","","","","","","","","","","","","","","","","","","","","","","","","","","","",""]
[null,203,null,null,null,null,null,null,null,null,null,null,null,null,null,null,null,null,null,null,null,null,null,null,"","","","","","","","","","","","","","","","","","","","","","","","","","","","","","","","","","","","","","","","","","","","","",""]
[null,204,null,null,null,null,null,null,null,null,null,null,null,null,null,null,null,null,null,null,null,null,null,null,"","","","","","","","","","","","","","","","","","","","","","","","","","","","","","","","","","","","","","","","","","","","","",""]
[null,205,null,null,null,null,null,null,null,null,null,null,null,null,null,null,null,null,null,null,null,null,null,null,"","","","","","","","","","","","","","","","","","","","","","","","","","","","","","","","","","","","","","","","","","","","","",""]
[null,206,null,null,null,null,null,null,null,null,null,null,null,null,null,null,null,null,null,null,null,null,null,null,"","","","","","","","","","","","","","","","","","","","","","","","","","","","","","","","","","","","","","","","","","","","","",""]
[null,207,null,null,null,null,null,null,null,null,null,null,null,null,null,null,null,null,null,null,null,null,null,null,"","","","","","","","","","","","","","","","","","","","","","","","","","","","","","","","","","","","","","","","","","","","","",""]
[null,208,null,null,null,null,null,null,null,null,null,null,null,null,null,null,null,null,null,null,null,null,null,null,"","","","","","","","","","","","","","","","","","","","","","","","","","","","","","","","","","","","","","","","","","","","","",""]
[null,209,null,null,null,null,null,null,null,null,null,null,null,null,null,null,null,null,null,null,null,null,null,null,"","","","","","","","","","","","","","","","","","","","","","","","","","","","","","","","","","","","","","","","","","","","","",""]
[null,210,null,null,null,null,null,null,null,null,null,null,null,null,null,null,null,null,null,null,null,null,null,null,"","","","","","","","","","","","","","","","","","","","","","","","","","","","","","","","","","","","","","","","","","","","","",""]
[null,211,null,null,null,null,null,null,null,null,null,null,null,null,null,null,null,null,null,null,null,null,null,null,"","","","","","","","","","","","","","","","","","","","","","","","","","","","","","","","","","","","","","","","","","","","","",""]
[null,212,null,null,null,null,null,null,null,null,null,null,null,null,null,null,null,null,null,null,null,null,null,null,"","","","","","","","","","","","","","","","","","","","","","","","","","","","","","","","","","","","","","","","","","","","","",""]
[null,213,null,null,null,null,null,null,null,null,null,null,null,null,null,null,null,null,null,null,null,null,null,null,"","","","","","","","","","","","","","","","","","","","","","","","","","","","","","","","","","","","","","","","","","","","","",""]
[null,214,null,null,null,null,null,null,null,null,null,null,null,null,null,null,null,null,null,null,null,null,null,null,"","","","","","","","","","","","","","","","","","","","","","","","","","","","","","","","","","","","","","","","","","","","","",""]
[null,215,null,null,null,null,null,null,null,null,null,null,null,null,null,null,null,null,null,null,null,null,null,null,"","","","","","","","","","","","","","","","","","","","","","","","","","","","","","","","","","","","","","","","","","","","","",""]
[null,216,null,null,null,null,null,null,null,null,null,null,null,null,null,null,null,null,null,null,null,null,null,null,"","","","","","","","","","","","","","","","","","","","","","","","","","","","","","","","","","","","","","","","","","","","","",""]
[null,217,null,null,null,null,null,null,null,null,null,null,null,null,null,null,null,null,null,null,null,null,null,null,"","","","","","","","","","","","","","","","","","","","","","","","","","","","","","","","","","","","","","","","","","","","","",""]
[null,218,null,null,null,null,null,null,null,null,null,null,null,null,null,null,null,null,null,null,null,null,null,null,"","","","","","","","","","","","","","","","","","","","","","","","","","","","","","","","","","","","","","","","","","","","","",""]
[null,219,null,null,null,null,null,null,null,null,null,null,null,null,null,null,null,null,null,null,null,null,null,null,"","","","","","","","","","","","","","","","","","","","","","","","","","","","","","","","","","","","","","","","","","","","","",""]
[null,220,null,null,null,null,null,null,null,null,null,null,null,null,null,null,null,null,null,null,null,null,null,null,"","","","","","","","","","","","","","","","","","","","","","","","","","","","","","","","","","","","","","","","","","","","","",""]
[null,221,null,null,null,null,null,null,null,null,null,null,null,null,null,null,null,null,null,null,null,null,null,null,"","","","","","","","","","","","","","","","","","","","","","","","","","","","","","","","","","","","","","","","","","","","","",""]
[null,222,null,null,null,null,null,null,null,null,null,null,null,null,null,null,null,null,null,null,null,null,null,null,"","","","","","","","","","","","","","","","","","","","","","","","","","","","","","","","","","","","","","","","","","","","","",""]
[null,223,null,null,null,null,null,null,null,null,null,null,null,null,null,null,null,null,null,null,null,null,null,null,"","","","","","","","","","","","","","","","","","","","","","","","","","","","","","","","","","","","","","","","","","","","","",""]
[null,224,null,null,null,null,null,null,null,null,null,null,null,null,null,null,null,null,null,null,null,null,null,null,"","","","","","","","","","","","","","","","","","","","","","","","","","","","","","","","","","","","","","","","","","","","","",""]
[null,225,null,null,null,null,null,null,null,null,null,null,null,null,null,null,null,null,null,null,null,null,null,null,"","","","","","","","","","","","","","","","","","","","","","","","","","","","","","","","","","","","","","","","","","","","","",""]
[null,226,null,null,null,null,null,null,null,null,null,null,null,null,null,null,null,null,null,null,null,null,null,null,"","","","","","","","","","","","","","","","","","","","","","","","","","","","","","","","","","","","","","","","","","","","","",""]
[null,227,null,null,null,null,null,null,null,null,null,null,null,null,null,null,null,null,null,null,null,null,null,null,"","","","","","","","","","","","","","","","","","","","","","","","","","","","","","","","","","","","","","","","","","","","","",""]
[null,228,null,null,null,null,null,null,null,null,null,null,null,null,null,null,null,null,null,null,null,null,null,null,"","","","","","","","","","","","","","","","","","","","","","","","","","","","","","","","","","","","","","","","","","","","","",""]
[null,229,null,null,null,null,null,null,null,null,null,null,null,null,null,null,null,null,null,null,null,null,null,null,"","","","","","","","","","","","","","","","","","","","","","","","","","","","","","","","","","","","","","","","","","","","","",""]
[null,230,null,null,null,null,null,null,null,null,null,null,null,null,null,null,null,null,null,null,null,null,null,null,"","","","","","","","","","","","","","","","","","","","","","","","","","","","","","","","","","","","","","","","","","","","","",""]
[null,231,null,null,null,null,null,null,null,null,null,null,null,null,null,null,null,null,null,null,null,null,null,null,"","","","","","","","","","","","","","","","","","","","","","","","","","","","","","","","","","","","","","","","","","","","","",""]
[null,232,null,null,null,null,null,null,null,null,null,null,null,null,null,null,null,null,null,null,null,null,null,null,"","","","","","","","","","","","","","","","","","","","","","","","","","","","","","","","","","","","","","","","","","","","","",""]
[null,233,null,null,null,null,null,null,null,null,null,null,null,null,null,null,null,null,null,null,null,null,null,null,"","","","","","","","","","","","","","","","","","","","","","","","","","","","","","","","","","","","","","","","","","","","","",""]
[null,234,null,null,null,null,null,null,null,null,null,null,null,null,null,null,null,null,null,null,null,null,null,null,"","","","","","","","","","","","","","","","","","","","","","","","","","","","","","","","","","","","","","","","","","","","","",""]
[null,235,null,null,null,null,null,null,null,null,null,null,null,null,null,null,null,null,null,null,null,null,null,null,"","","","","","","","","","","","","","","","","","","","","","","","","","","","","","","","","","","","","","","","","","","","","",""]
[null,236,null,null,null,null,null,null,null,null,null,null,null,null,null,null,null,null,null,null,null,null,null,null,"","","","","","","","","","","","","","","","","","","","","","","","","","","","","","","","","","","","","","","","","","","","","",""]
[null,237,null,null,null,null,null,null,null,null,null,null,null,null,null,null,null,null,null,null,null,null,null,null,"","","","","","","","","","","","","","","","","","","","","","","","","","","","","","","","","","","","","","","","","","","","","",""]
[null,238,null,null,null,null,null,null,null,null,null,null,null,null,null,null,null,null,null,null,null,null,null,null,"","","","","","","","","","","","","","","","","","","","","","","","","","","","","","","","","","","","","","","","","","","","","",""]
[null,239,null,null,null,null,null,null,null,null,null,null,null,null,null,null,null,null,null,null,null,null,null,null,"","","","","","","","","","","","","","","","","","","","","","","","","","","","","","","","","","","","","","","","","","","","","",""]
[null,240,null,null,null,null,null,null,null,null,null,null,null,null,null,null,null,null,null,null,null,null,null,null,"","","","","","","","","","","","","","","","","","","","","","","","","","","","","","","","","","","","","","","","","","","","","",""]
[null,241,null,null,null,null,null,null,null,null,null,null,null,null,null,null,null,null,null,null,null,null,null,null,"","","","","","","","","","","","","","","","","","","","","","","","","","","","","","","","","","","","","","","","","","","","","",""]
[null,242,null,null,null,null,null,null,null,null,null,null,null,null,null,null,null,null,null,null,null,null,null,null,"","","","","","","","","","","","","","","","","","","","","","","","","","","","","","","","","","","","","","","","","","","","","",""]
[null,243,null,null,null,null,null,null,null,null,null,null,null,null,null,null,null,null,null,null,null,null,null,null,"","","","","","","","","","","","","","","","","","","","","","","","","","","","","","","","","","","","","","","","","","","","","",""]
[null,244,null,null,null,null,null,null,null,null,null,null,null,null,null,null,null,null,null,null,null,null,null,null,"","","","","","","","","","","","","","","","","","","","","","","","","","","","","","","","","","","","","","","","","","","","","",""]
[null,245,null,null,null,null,null,null,null,null,null,null,null,null,null,null,null,null,null,null,null,null,null,null,"","","","","","","","","","","","","","","","","","","","","","","","","","","","","","","","","","","","","","","","","","","","","",""]
[null,246,null,null,null,null,null,null,null,null,null,null,null,null,null,null,null,null,null,null,null,null,null,null,"","","","","","","","","","","","","","","","","","","","","","","","","","","","","","","","","","","","","","","","","","","","","",""]
[null,247,null,null,null,null,null,null,null,null,null,null,null,null,null,null,null,null,null,null,null,null,null,null,"","","","","","","","","","","","","","","","","","","","","","","","","","","","","","","","","","","","","","","","","","","","","",""]
[null,248,null,null,null,null,null,null,null,null,null,null,null,null,null,null,null,null,null,null,null,null,null,null,"","","","","","","","","","","","","","","","","","","","","","","","","","","","","","","","","","","","","","","","","","","","","",""]
[null,249,null,null,null,null,null,null,null,null,null,null,null,null,null,null,null,null,null,null,null,null,null,null,"","","","","","","","","","","","","","","","","","","","","","","","","","","","","","","","","","","","","","","","","","","","","",""]
[null,250,null,null,null,null,null,null,null,null,null,null,null,null,null,null,null,null,null,null,null,null,null,null,"","","","","","","","","","","","","","","","","","","","","","","","","","","","","","","","","","","","","","","","","","","","","",""]
[null,251,null,null,null,null,null,null,null,null,null,null,null,null,null,null,null,null,null,null,null,null,null,null,"","","","","","","","","","","","","","","","","","","","","","","","","","","","","","","","","","","","","","","","","","","","","",""]
[null,252,null,null,null,null,null,null,null,null,null,null,null,null,null,null,null,null,null,null,null,null,null,null,"","","","","","","","","","","","","","","","","","","","","","","","","","","","","","","","","","","","","","","","","","","","","",""]
[null,253,null,null,null,null,null,null,null,null,null,null,null,null,null,null,null,null,null,null,null,null,null,null,"","","","","","","","","","","","","","","","","","","","","","","","","","","","","","","","","","","","","","","","","","","","","",""]
[null,254,null,null,null,null,null,null,null,null,null,null,null,null,null,null,null,null,null,null,null,null,null,null,"","","","","","","","","","","","","","","","","","","","","","","","","","","","","","","","","","","","","","","","","","","","","",""]
[null,255,null,null,null,null,null,null,null,null,null,null,null,null,null,null,null,null,null,null,null,null,null,null,"","","","","","","","","","","","","","","","","","","","","","","","","","","","","","","","","","","","","","","","","","","","","",""]
[null,256,null,null,null,null,null,null,null,null,null,null,null,null,null,null,null,null,null,null,null,null,null,null,"","","","","","","","","","","","","","","","","","","","","","","","","","","","","","","","","","","","","","","","","","","","","",""]
[null,257,null,null,null,null,null,null,null,null,null,null,null,null,null,null,null,null,null,null,null,null,null,null,"",{"$f":"IF(F264=\"\",\"\",CONCATENATE($V$7,\".\",F264))","v":""},{"$f":"IF(H264=\"\",\"\",IF(H264=\"BYTE\",\"Integer\",IF(H264=\"WORD\",\"UINT\",IF(H264=\"DWORD\",\"UDINT\",H264))))","v":""},"","",{"$f":"IF(F264=\"\",\"\",CONCATENATE(R264))","v":""},"","","","","","","","","","","","","","","","","","","","",{"$f":"IF(AA265=\"\",\"\",CONCATENATE(\"%MW\",E264))","v":""},"","","","","","","","","","","","","","","","","","",""]
[null,258,null,null,null,null,null,null,null,null,null,null,null,null,null,null,null,null,null,null,null,null,null,null,{"$f":"IF(IFERROR(Z266,\"\")=\"\",\"\",\"Variable\")","v":""},"","",{"$f":"IF(AA266=\"\",\"\",$V$8)","v":""},{"$f":"IF(AA266=\"\",\"\",$V$13)","v":""},"",{"$f":"IF(AA266=\"\",\"\",J265)","v":""},{"$f":"IF(AA266=\"\",\"\",IF(AA266=\"BOOL\",\"\", IF(AA266=\"INT\",\"\",IF(AA266=\"DINT\",\"\",IF(AA266=\"UINT\",\"\",IF(AA266=\"REAL\",\"\",IF(AA266=\"Integer\",\"\",IF(AA266=\"UDINT\",\"\",\"\")))))) ))","v":""},{"$f":"IF(AA266=\"\",\"\",$V$9)","v":""},{"$f":"IF(AA266=\"\",\"\",$V$10)","v":""},{"$f":"IF(AA266=\"\",\"\",$V$11)","v":""},{"$f":"IF(AA266=\"\",\"\",IF(AA266=\"BOOL\",\"\", IF(AA266=\"INT\",\"\",IF(AA266=\"DINT\",\"\",IF(AA266=\"UINT\",\"\",IF(AA266=\"REAL\",\"\",IF(AA266=\"Integer\",\"\",IF(AA266=\"UDINT\",\"\",\"\")))))) ))","v":""},{"$f":"IF(AA266=\"\",\"\",IF(AA266=\"BOOL\",\"\", IF(AA266=\"INT\",\"\",IF(AA266=\"DINT\",\"\",IF(AA266=\"UINT\",\"\",IF(AA266=\"REAL\",\"\",IF(AA266=\"Integer\",\"\",IF(AA266=\"UDINT\",\"\",\"\")))))) ))","v":""},{"$f":"IF(AA266=\"\",\"\",IF(AA266=\"BOOL\",\"\", IF(AA266=\"INT\",\"\",IF(AA266=\"DINT\",\"\",IF(AA266=\"UINT\",\"\",IF(AA266=\"REAL\",\"\",IF(AA266=\"Integer\",\"\",IF(AA266=\"UDINT\",\"\",\"\")))))) ))","v":""},{"$f":"IF(AA266=\"\",\"\",IF(AA266=\"BOOL\",\"\", IF(AA266=\"INT\",\"\",IF(AA266=\"DINT\",\"\",IF(AA266=\"UINT\",\"\",IF(AA266=\"REAL\",\"\",IF(AA266=\"Integer\",\"\",IF(AA266=\"UDINT\",\"\",\"\")))))) ))","v":""},{"$f":"IF(AA266=\"\",\"\",IF(AA266=\"BOOL\",\"\", IF(AA266=\"INT\",\"\",IF(AA266=\"DINT\",\"\",IF(AA266=\"UINT\",\"\",IF(AA266=\"REAL\",\"\",IF(AA266=\"Integer\",\"\",IF(AA266=\"UDINT\",\"\",\"\")))))) ))","v":""},{"$f":"IF(AA266=\"\",\"\",IF(AA266=\"BOOL\",\"\", IF(AA266=\"INT\",\"\",IF(AA266=\"DINT\",\"\",IF(AA266=\"UINT\",\"\",IF(AA266=\"REAL\",\"\",IF(AA266=\"Integer\",\"\",IF(AA266=\"UDINT\",\"\",\"\")))))) ))","v":""},{"$f":"IF(AA266=\"\",\"\",IF(AA266=\"BOOL\",\"\", IF(AA266=\"INT\",\"\",IF(AA266=\"DINT\",\"\",IF(AA266=\"UINT\",\"\",IF(AA266=\"REAL\",\"\",IF(AA266=\"Integer\",\"\",IF(AA266=\"UDINT\",\"\",\"\")))))) ))","v":""},{"$f":"IF(AA266=\"\",\"\",IF(AA266=\"BOOL\",\"\", IF(AA266=\"INT\",\"\",IF(AA266=\"DINT\",\"\",IF(AA266=\"UINT\",\"\",IF(AA266=\"REAL\",\"\",IF(AA266=\"Integer\",\"\",IF(AA266=\"UDINT\",\"\",\"\")))))) ))","v":""},{"$f":"IF(AA266=\"\",\"\",IF(AA266=\"BOOL\",\"\", IF(AA266=\"INT\",\"\",IF(AA266=\"DINT\",\"\",IF(AA266=\"UINT\",\"\",IF(AA266=\"REAL\",\"\",IF(AA266=\"Integer\",\"\",IF(AA266=\"UDINT\",\"\",\"\")))))) ))","v":""},{"$f":"IF(AA266=\"\",\"\",IF(AA266=\"BOOL\",\"\", IF(AA266=\"INT\",\"\",IF(AA266=\"DINT\",\"\",IF(AA266=\"UINT\",\"\",IF(AA266=\"REAL\",\"\",IF(AA266=\"Integer\",\"\",IF(AA266=\"UDINT\",\"\",\"\")))))) ))","v":""},{"$f":"IF(AA266=\"\",\"\",IF(AA266=\"BOOL\",\"\", IF(AA266=\"INT\",\"\",IF(AA266=\"DINT\",\"\",IF(AA266=\"UINT\",\"\",IF(AA266=\"REAL\",\"\",IF(AA266=\"Integer\",\"\",IF(AA266=\"UDINT\",\"\",\"\")))))) ))","v":""},{"$f":"IF(AA266=\"\",\"\",IF(AA266=\"BOOL\",\"\", IF(AA266=\"INT\",\"\",IF(AA266=\"DINT\",\"\",IF(AA266=\"UINT\",\"\",IF(AA266=\"REAL\",\"\",IF(AA266=\"Integer\",\"\",IF(AA266=\"UDINT\",\"\",\"\")))))) ))","v":""},{"$f":"IF(AA266=\"\",\"\",IF(AA266=\"BOOL\",\"\", IF(AA266=\"INT\",\"\",IF(AA266=\"DINT\",\"\",IF(AA266=\"UINT\",\"\",IF(AA266=\"REAL\",\"\",IF(AA266=\"Integer\",\"\",IF(AA266=\"UDINT\",\"\",\"\")))))) ))","v":""},{"$f":"IF(AA266=\"\",\"\",IF(AA266=\"BOOL\",\"\", IF(AA266=\"INT\",\"\",IF(AA266=\"DINT\",\"\",IF(AA266=\"UINT\",\"\",IF(AA266=\"REAL\",\"\",IF(AA266=\"Integer\",\"\",IF(AA266=\"UDINT\",\"\",\"\")))))) ))","v":""},{"$f":"IF(AA266=\"\",\"\",$V$12)","v":""},"",{"$f":"IF(AA266=\"\",\"\",IF( AA266=\"BOOL\",CONCATENATE(\"X\",\"0\"),\"\"))","v":""},{"$f":"IF(AA266=\"\",\"\",IF(AA266=\"BOOL\",\"\", IF(AA266=\"INT\",\"BIN\",IF(AA266=\"DINT\",\"BIN\",IF(AA266=\"UINT\",\"BIN\",IF(AA266=\"REAL\",\"\",IF(AA266=\"Integer\",\"BIN\",IF(AA266=\"UDINT\",\"BIN\",\"\")))))) ))","v":""},{"$f":"IF(AA266=\"\",\"\",IF(AA266=\"BOOL\",\"\", IF(AA266=\"INT\",\"2sComplement\",IF(AA266=\"DINT\",\"2sComplement\",IF(AA266=\"UINT\",\"Unsigned\",IF(AA266=\"REAL\",\"\",IF(AA266=\"Integer\",\"Unsigned\",IF(AA266=\"UDINT\",\"Unsigned\",\"\")))))) ))","v":""},{"$f":"IF(AA266=\"\",\"\",IF(AA266=\"BOOL\",\"\", IF(AA266=\"INT\",\"16Bits\",IF(AA266=\"DINT\",\"32Bits\",IF(AA266=\"UINT\",\"16Bits\",IF(AA266=\"REAL\",\"\",IF(AA266=\"Integer\",\"BitField\",IF(AA266=\"UDINT\",\"32Bits\",\"\")))))) ))","v":""},{"$f":"IF(AA266=\"\",\"\",IF(AA266=\"BOOL\",\"\", IF(AA266=\"INT\",\"\",IF(AA266=\"DINT\",\"\",IF(AA266=\"UINT\",\"\",IF(AA266=\"REAL\",\"\",IF(AA266=\"Integer\",\"0\",IF(AA266=\"UDINT\",\"\",\"\")))))) ))","v":""},{"$f":"IF(AA266=\"\",\"\",IF(AA266=\"BOOL\",\"\", IF(AA266=\"INT\",\"\",IF(AA266=\"DINT\",\"\",IF(AA266=\"UINT\",\"\",IF(AA266=\"REAL\",\"\",IF(AA266=\"Integer\",\"8\",IF(AA266=\"UDINT\",\"\",\"\")))))) ))","v":""},{"$f":"IF(AA266=\"\",\"\",IF(AA266=\"BOOL\",\"\", IF(AA266=\"INT\",\"Disable\",IF(AA266=\"DINT\",\"Disable\",IF(AA266=\"UINT\",\"Disable\",IF(AA266=\"REAL\",\"Disable\",IF(AA266=\"Integer\",\"Disable\",IF(AA266=\"UDINT\",\"Disable\",\"\")))))) ))","v":""},{"$f":"IF(AA266=\"\",\"\",IF(AA266=\"BOOL\",\"\", IF(AA266=\"INT\",\"\",IF(AA266=\"DINT\",\"\",IF(AA266=\"UINT\",\"\",IF(AA266=\"REAL\",\"\",IF(AA266=\"Integer\",\"\",IF(AA266=\"UDINT\",\"\",\"\")))))) ))","v":""},{"$f":"IF(AA266=\"\",\"\",IF(AA266=\"BOOL\",\"\", IF(AA266=\"INT\",\"\",IF(AA266=\"DINT\",\"\",IF(AA266=\"UINT\",\"\",IF(AA266=\"REAL\",\"\",IF(AA266=\"Integer\",\"\",IF(AA266=\"UDINT\",\"\",\"\")))))) ))","v":""},{"$f":"IF(AA266=\"\",\"\",IF(AA266=\"BOOL\",\"\", IF(AA266=\"INT\",\"Disable\",IF(AA266=\"DINT\",\"Disable\",IF(AA266=\"UINT\",\"Disable\",IF(AA266=\"REAL\",\"Disable\",IF(AA266=\"Integer\",\"Disable\",IF(AA266=\"UDINT\",\"Disable\",\"\")))))) ))","v":""},{"$f":"IF(AA266=\"\",\"\",IF(AA266=\"BOOL\",\"\", IF(AA266=\"INT\",\"\",IF(AA266=\"DINT\",\"\",IF(AA266=\"UINT\",\"\",IF(AA266=\"REAL\",\"\",IF(AA266=\"Integer\",\"\",IF(AA266=\"UDINT\",\"\",\"\")))))) ))","v":""},{"$f":"IF(AA266=\"\",\"\",IF(AA266=\"BOOL\",\"\", IF(AA266=\"INT\",\"\",IF(AA266=\"DINT\",\"\",IF(AA266=\"UINT\",\"\",IF(AA266=\"REAL\",\"\",IF(AA266=\"Integer\",\"\",IF(AA266=\"UDINT\",\"\",\"\")))))) ))","v":""},{"$f":"IF(AA266=\"\",\"\",IF(AA266=\"BOOL\",\"\", IF(AA266=\"INT\",\"\",IF(AA266=\"DINT\",\"\",IF(AA266=\"UINT\",\"\",IF(AA266=\"REAL\",\"\",IF(AA266=\"Integer\",\"\",IF(AA266=\"UDINT\",\"\",\"\")))))) ))","v":""},{"$f":"IF(AA266=\"\",\"\",IF(AA266=\"BOOL\",\"\", IF(AA266=\"INT\",\"\",IF(AA266=\"DINT\",\"\",IF(AA266=\"UINT\",\"\",IF(AA266=\"REAL\",\"\",IF(AA266=\"Integer\",\"\",IF(AA266=\"UDINT\",\"\",\"\")))))) ))","v":""},{"$f":"IF(AA266=\"\",\"\",IF(AA266=\"BOOL\",\"Disable\", IF(AA266=\"INT\",\"Disable\",IF(AA266=\"DINT\",\"Disable\",IF(AA266=\"UINT\",\"Disable\",IF(AA266=\"REAL\",\"Disable\",IF(AA266=\"Integer\",\"Disable\",IF(AA266=\"UDINT\",\"Disable\",\"\")))))) ))","v":""},{"$f":"IF(AA266=\"\",\"\",IF(AA266=\"BOOL\",\"\", IF(AA266=\"INT\",\"\",IF(AA266=\"DINT\",\"\",IF(AA266=\"UINT\",\"\",IF(AA266=\"REAL\",\"\",IF(AA266=\"Integer\",\"\",IF(AA266=\"UDINT\",\"\",\"\")))))) ))","v":""},{"$f":"IF(AA266=\"\",\"\",IF(AA266=\"BOOL\",\"\", IF(AA266=\"INT\",\"\",IF(AA266=\"DINT\",\"\",IF(AA266=\"UINT\",\"\",IF(AA266=\"REAL\",\"\",IF(AA266=\"Integer\",\"\",IF(AA266=\"UDINT\",\"\",\"\")))))) ))","v":""},{"$f":"IF(AA266=\"\",\"\",IF(AA266=\"BOOL\",\"None\", IF(AA266=\"INT\",\"None\",IF(AA266=\"DINT\",\"None\",IF(AA266=\"UINT\",\"None\",IF(AA266=\"REAL\",\"None\",IF(AA266=\"Integer\",\"None\",IF(AA266=\"UDINT\",\"None\",\"\")))))) ))","v":""},{"$f":"IF(AA266=\"\",\"\",IF(AA266=\"BOOL\",\"Disable\", IF(AA266=\"INT\",\"Disable\",IF(AA266=\"DINT\",\"Disable\",IF(AA266=\"UINT\",\"Disable\",IF(AA266=\"REAL\",\"Disable\",IF(AA266=\"Integer\",\"Disable\",IF(AA266=\"UDINT\",\"Disable\",\"\")))))) ))","v":""}]
[null,259,null,null,null,null,null,null,null,null,null,null,null,null,null,null,null,null,null,null,null,null,null,null,"","","","","","","","","","","","","","","","","","","","","","","","","","","","","","","","","","","","","","","","","","","","","",""]
[null,260,null,null,null,null,null,null,null,null,null,null,null,null,null,null,null,null,null,null,null,null,null,null,"","","","","","","","","","","","","","","","","","","","","","","","","","","","","","","","","","","","","","","","","","","","","",""]
[null,261,null,null,null,null,null,null,null,null,null,null,null,null,null,null,null,null,null,null,null,null,null,null,"","","","","","","","","","","","","","","","","","","","","","","","","","","","","","","","","","","","","","","","","","","","","",""]
[null,262,null,null,null,null,null,null,null,null,null,null,null,null,null,null,null,null,null,null,null,null,null,null,"","","","","","","","","","","","","","","","","","","","","","","","","","","","","","","","","","","","","","","","","","","","","",""]
[null,263,null,null,null,null,null,null,null,null,null,null,null,null,null,null,null,null,null,null,null,null,null,null,"","","","","","","","","","","","","","","","","","","","","","","","","","","","","","","","","","","","","","","","","","","","","",""]
[null,264,null,null,null,null,null,null,null,null,null,null,null,null,null,null,null,null,null,null,null,null,null,null,"","","","","","","","","","","","","","","","","","","","","","","","","","","","","","","","","","","","","","","","","","","","","",""]
[null,265,null,null,null,null,null,null,null,null,null,null,null,null,null,null,null,null,null,null,null,null,null,null,"","","","","","","","","","","","","","","","","","","","","","","","","","","","","","","","","","","","","","","","","","","","","",""]
[null,266,null,null,null,null,null,null,null,null,null,null,null,null,null,null,null,null,null,null,null,null,null,null,"","","","","","","","","","","","","","","","","","","","","","","","","","","","","","","","","","","","","","","","","","","","","",""]
[null,267,null,null,null,null,null,null,null,null,null,null,null,null,null,null,null,null,null,null,null,null,null,null,"","","","","","","","","","","","","","","","","","","","","","","","","","","","","","","","","","","","","","","","","","","","","",""]
[null,268,null,null,null,null,null,null,null,null,null,null,null,null,null,null,null,null,null,null,null,null,null,null,"","","","","","","","","","","","","","","","","","","","","","","","","","","","","","","","","","","","","","","","","","","","","",""]
[null,269,null,null,null,null,null,null,null,null,null,null,null,null,null,null,null,null,null,null,null,null,null,null,"","","","","","","","","","","","","","","","","","","","","","","","","","","","","","","","","","","","","","","","","","","","","",""]
[null,270,null,null,null,null,null,null,null,null,null,null,null,null,null,null,null,null,null,null,null,null,null,null,"","","","","","","","","","","","","","","","","","","","","","","","","","","","","","","","","","","","","","","","","","","","","",""]
[null,271,null,null,null,null,null,null,null,null,null,null,null,null,null,null,null,null,null,null,null,null,null,null,"","","","","","","","","","","","","","","","","","","","","","","","","","","","","","","","","","","","","","","","","","","","","",""]
[null,272,null,null,null,null,null,null,null,null,null,null,null,null,null,null,null,null,null,null,null,null,null,null,"","","","","","","","","","","","","","","","","","","","","","","","","","","","","","","","","","","","","","","","","","","","","",""]
[null,273,null,null,null,null,null,null,null,null,null,null,null,null,null,null,null,null,null,null,null,null,null,null,"","","","","","","","","","","","","","","","","","","","","","","","","","","","","","","","","","","","","","","","","","","","","",""]
[null,274,null,null,null,null,null,null,null,null,null,null,null,null,null,null,null,null,null,null,null,null,null,null,"","","","","","","","","","","","","","","","","","","","","","","","","","","","","","","","","","","","","","","","","","","","","",""]
[null,275,null,null,null,null,null,null,null,null,null,null,null,null,null,null,null,null,null,null,null,null,null,null,"","","","","","","","","","","","","","","","","","","","","","","","","","","","","","","","","","","","","","","","","","","","","",""]
[null,276,null,null,null,null,null,null,null,null,null,null,null,null,null,null,null,null,null,null,null,null,null,null,"","","","","","","","","","","","","","","","","","","","","","","","","","","","","","","","","","","","","","","","","","","","","",""]
[null,277,null,null,null,null,null,null,null,null,null,null,null,null,null,null,null,null,null,null,null,null,null,null,"","","","","","","","","","","","","","","","","","","","","","","","","","","","","","","","","","","","","","","","","","","","","",""]
[null,278,null,null,null,null,null,null,null,null,null,null,null,null,null,null,null,null,null,null,null,null,null,null,"","","","","","","","","","","","","","","","","","","","","","","","","","","","","","","","","","","","","","","","","","","","","",""]
[null,279,null,null,null,null,null,null,null,null,null,null,null,null,null,null,null,null,null,null,null,null,null,null,"","","","","","","","","","","","","","","","","","","","","","","","","","","","","","","","","","","","","","","","","","","","","",""]
[null,280,null,null,null,null,null,null,null,null,null,null,null,null,null,null,null,null,null,null,null,null,null,null,"","","","","","","","","","","","","","","","","","","","","","","","","","","","","","","","","","","","","","","","","","","","","",""]
[null,281,null,null,null,null,null,null,null,null,null,null,null,null,null,null,null,null,null,null,null,null,null,null,"","","","","","","","","","","","","","","","","","","","","","","","","","","","","","","","","","","","","","","","","","","","","",""]
[null,282,null,null,null,null,null,null,null,null,null,null,null,null,null,null,null,null,null,null,null,null,null,null,"","","","","","","","","","","","","","","","","","","","","","","","","","","","","","","","","","","","","","","","","","","","","",""]
[null,283,null,null,null,null,null,null,null,null,null,null,null,null,null,null,null,null,null,null,null,null,null,null,"","","","","","","","","","","","","","","","","","","","","","","","","","","","","","","","","","","","","","","","","","","","","",""]
[null,284,null,null,null,null,null,null,null,null,null,null,null,null,null,null,null,null,null,null,null,null,null,null,"","","","","","","","","","","","","","","","","","","","","","","","","","","","","","","","","","","","","","","","","","","","","",""]
[null,285,null,null,null,null,null,null,null,null,null,null,null,null,null,null,null,null,null,null,null,null,null,null,"","","","","","","","","","","","","","","","","","","","","","","","","","","","","","","","","","","","","","","","","","","","","",""]
[null,286,null,null,null,null,null,null,null,null,null,null,null,null,null,null,null,null,null,null,null,null,null,null,"","","","","","","","","","","","","","","","","","","","","","","","","","","","","","","","","","","","","","","","","","","","","",""]
[null,287,null,null,null,null,null,null,null,null,null,null,null,null,null,null,null,null,null,null,null,null,null,null,"","","","","","","","","","","","","","","","","","","","","","","","","","","","","","","","","","","","","","","","","","","","","",""]
[null,288,null,null,null,null,null,null,null,null,null,null,null,null,null,null,null,null,null,null,null,null,null,null,"","","","","","","","","","","","","","","","","","","","","","","","","","","","","","","","","","","","","","","","","","","","","",""]
[null,289,null,null,null,null,null,null,null,null,null,null,null,null,null,null,null,null,null,null,null,null,null,null,"","","","","","","","","","","","","","","","","","","","","","","","","","","","","","","","","","","","","","","","","","","","","",""]
[null,290,null,null,null,null,null,null,null,null,null,null,null,null,null,null,null,null,null,null,null,null,null,null,"","","","","","","","","","","","","","","","","","","","","","","","","","","","","","","","","","","","","","","","","","","","","",""]
[null,291,null,null,null,null,null,null,null,null,null,null,null,null,null,null,null,null,null,null,null,null,null,null,"","","","","","","","","","","","","","","","","","","","","","","","","","","","","","","","","","","","","","","","","","","","","",""]
[null,292,null,null,null,null,null,null,null,null,null,null,null,null,null,null,null,null,null,null,null,null,null,null,"","","","","","","","","","","","","","","","","","","","","","","","","","","","","","","","","","","","","","","","","","","","","",""]
[null,293,null,null,null,null,null,null,null,null,null,null,null,null,null,null,null,null,null,null,null,null,null,null,"","","","","","","","","","","","","","","","","","","","","","","","","","","","","","","","","","","","","","","","","","","","","",""]
[null,294,null,null,null,null,null,null,null,null,null,null,null,null,null,null,null,null,null,null,null,null,null,null,"","","","","","","","","","","","","","","","","","","","","","","","","","","","","","","","","","","","","","","","","","","","","",""]
[null,295,null,null,null,null,null,null,null,null,null,null,null,null,null,null,null,null,null,null,null,null,null,null,"","","","","","","","","","","","","","","","","","","","","","","","","","","","","","","","","","","","","","","","","","","","","",""]
[null,296,null,null,null,null,null,null,null,null,null,null,null,null,null,null,null,null,null,null,null,null,null,null,"","","","","","","","","","","","","","","","","","","","","","","","","","","","","","","","","","","","","","","","","","","","","",""]
[null,297,null,null,null,null,null,null,null,null,null,null,null,null,null,null,null,null,null,null,null,null,null,null,"","","","","","","","","","","","","","","","","","","","","","","","","","","","","","","","","","","","","","","","","","","","","",""]
[null,298,null,null,null,null,null,null,null,null,null,null,null,null,null,null,null,null,null,null,null,null,null,null,"","","","","","","","","","","","","","","","","","","","","","","","","","","","","","","","","","","","","","","","","","","","","",""]
[null,299,null,null,null,null,null,null,null,null,null,null,null,null,null,null,null,null,null,null,null,null,null,null,"","","","","","","","","","","","","","","","","","","","","","","","","","","","","","","","","","","","","","","","","","","","","",""]
[null,300,null,null,null,null,null,null,null,null,null,null,null,null,null,null,null,null,null,null,null,null,null,null,"","","","","","","","","","","","","","","","","","","","","","","","","","","","","","","","","","","","","","","","","","","","","",""]
[null,301,null,null,null,null,null,null,null,null,null,null,null,null,null,null,null,null,null,null,null,null,null,null,"","","","","","","","","","","","","","","","","","","","","","","","","","","","","","","","","","","","","","","","","","","","","",""]
[null,302,null,null,null,null,null,null,null,null,null,null,null,null,null,null,null,null,null,null,null,null,null,null,"","","","","","","","","","","","","","","","","","","","","","","","","","","","","","","","","","","","","","","","","","","","","",""]
[null,303,null,null,null,null,null,null,null,null,null,null,null,null,null,null,null,null,null,null,null,null,null,null,"","","","","","","","","","","","","","","","","","","","","","","","","","","","","","","","","","","","","","","","","","","","","",""]
[null,304,null,null,null,null,null,null,null,null,null,null,null,null,null,null,null,null,null,null,null,null,null,null,"","","","","","","","","","","","","","","","","","","","","","","","","","","","","","","","","","","","","","","","","","","","","",""]
[null,305,null,null,null,null,null,null,null,null,null,null,null,null,null,null,null,null,null,null,null,null,null,null,"","","","","","","","","","","","","","","","","","","","","","","","","","","","","","","","","","","","","","","","","","","","","",""]
[null,306,null,null,null,null,null,null,null,null,null,null,null,null,null,null,null,null,null,null,null,null,null,null,"","","","","","","","","","","","","","","","","","","","","","","","","","","","","","","","","","","","","","","","","","","","","",""]
[null,307,null,null,null,null,null,null,null,null,null,null,null,null,null,null,null,null,null,null,null,null,null,null,"","","","","","","","","","","","","","","","","","","","","","","","","","","","","","","","","","","","","","","","","","","","","",""]
[null,308,null,null,null,null,null,null,null,null,null,null,null,null,null,null,null,null,null,null,null,null,null,null,"","","","","","","","","","","","","","","","","","","","","","","","","","","","","","","","","","","","","","","","","","","","","",""]
[null,309,null,null,null,null,null,null,null,null,null,null,null,null,null,null,null,null,null,null,null,null,null,null,"","","","","","","","","","","","","","","","","","","","","","","","","","","","","","","","","","","","","","","","","","","","","",""]
[null,310,null,null,null,null,null,null,null,null,null,null,null,null,null,null,null,null,null,null,null,null,null,null,"","","","","","","","","","","","","","","","","","","","","","","","","","","","","","","","","","","","","","","","","","","","","",""]
[null,311,null,null,null,null,null,null,null,null,null,null,null,null,null,null,null,null,null,null,null,null,null,null,"","","","","","","","","","","","","","","","","","","","","","","","","","","","","","","","","","","","","","","","","","","","","",""]
[null,312,null,null,null,null,null,null,null,null,null,null,null,null,null,null,null,null,null,null,null,null,null,null,"","","","","","","","","","","","","","","","","","","","","","","","","","","","","","","","","","","","","","","","","","","","","",""]
[null,313,null,null,null,null,null,null,null,null,null,null,null,null,null,null,null,null,null,null,null,null,null,null,"","","","","","","","","","","","","","","","","","","","","","","","","","","","","","","","","","","","","","","","","","","","","",""]
[null,314,null,null,null,null,null,null,null,null,null,null,null,null,null,null,null,null,null,null,null,null,null,null,"","","","","","","","","","","","","","","","","","","","","","","","","","","","","","","","","","","","","","","","","","","","","",""]
[null,315,null,null,null,null,null,null,null,null,null,null,null,null,null,null,null,null,null,null,null,null,null,null,"","","","","","","","","","","","","","","","","","","","","","","","","","","","","","","","","","","","","","","","","","","","","",""]
[null,316,null,null,null,null,null,null,null,null,null,null,null,null,null,null,null,null,null,null,null,null,null,null,"","","","","","","","","","","","","","","","","","","","","","","","","","","","","","","","","","","","","","","","","","","","","",""]
[null,317,null,null,null,null,null,null,null,null,null,null,null,null,null,null,null,null,null,null,null,null,null,null,"","","","","","","","","","","","","","","","","","","","","","","","","","","","","","","","","","","","","","","","","","","","","",""]
[null,318,null,null,null,null,null,null,null,null,null,null,null,null,null,null,null,null,null,null,null,null,null,null,"","","","","","","","","","","","","","","","","","","","","","","","","","","","","","","","","","","","","","","","","","","","","",""]
[null,319,null,null,null,null,null,null,null,null,null,null,null,null,null,null,null,null,null,null,null,null,null,null,"","","","","","","","","","","","","","","","","","","","","","","","","","","","","","","","","","","","","","","","","","","","","",""]
[null,320,null,null,null,null,null,null,null,null,null,null,null,null,null,null,null,null,null,null,null,null,null,null,"","","","","","","","","","","","","","","","","","","","","","","","","","","","","","","","","","","","","","","","","","","","","",""]
[null,321,null,null,null,null,null,null,null,null,null,null,null,null,null,null,null,null,null,null,null,null,null,null,"",{"$f":"IF(F328=\"\",\"\",CONCATENATE($V$7,\".\",F328))","v":""},{"$f":"IF(H328=\"\",\"\",IF(H328=\"BYTE\",\"Integer\",IF(H328=\"WORD\",\"UINT\",IF(H328=\"DWORD\",\"UDINT\",H328))))","v":""},"","",{"$f":"IF(F328=\"\",\"\",CONCATENATE(R328))","v":""},"","","","","","","","","","","","","","","","","","","","",{"$f":"IF(AA329=\"\",\"\",CONCATENATE(\"%MW\",E328))","v":""},"","","","","","","","","","","","","","","","","","",""]
[null,322,null,null,null,null,null,null,null,null,null,null,null,null,null,null,null,null,null,null,null,null,null,null,{"$f":"IF(IFERROR(Z330,\"\")=\"\",\"\",\"Variable\")","v":""},"","",{"$f":"IF(AA330=\"\",\"\",$V$8)","v":""},{"$f":"IF(AA330=\"\",\"\",$V$13)","v":""},"",{"$f":"IF(AA330=\"\",\"\",J329)","v":""},{"$f":"IF(AA330=\"\",\"\",IF(AA330=\"BOOL\",\"\", IF(AA330=\"INT\",\"\",IF(AA330=\"DINT\",\"\",IF(AA330=\"UINT\",\"\",IF(AA330=\"REAL\",\"\",IF(AA330=\"Integer\",\"\",IF(AA330=\"UDINT\",\"\",\"\")))))) ))","v":""},{"$f":"IF(AA330=\"\",\"\",$V$9)","v":""},{"$f":"IF(AA330=\"\",\"\",$V$10)","v":""},{"$f":"IF(AA330=\"\",\"\",$V$11)","v":""},{"$f":"IF(AA330=\"\",\"\",IF(AA330=\"BOOL\",\"\", IF(AA330=\"INT\",\"\",IF(AA330=\"DINT\",\"\",IF(AA330=\"UINT\",\"\",IF(AA330=\"REAL\",\"\",IF(AA330=\"Integer\",\"\",IF(AA330=\"UDINT\",\"\",\"\")))))) ))","v":""},{"$f":"IF(AA330=\"\",\"\",IF(AA330=\"BOOL\",\"\", IF(AA330=\"INT\",\"\",IF(AA330=\"DINT\",\"\",IF(AA330=\"UINT\",\"\",IF(AA330=\"REAL\",\"\",IF(AA330=\"Integer\",\"\",IF(AA330=\"UDINT\",\"\",\"\")))))) ))","v":""},{"$f":"IF(AA330=\"\",\"\",IF(AA330=\"BOOL\",\"\", IF(AA330=\"INT\",\"\",IF(AA330=\"DINT\",\"\",IF(AA330=\"UINT\",\"\",IF(AA330=\"REAL\",\"\",IF(AA330=\"Integer\",\"\",IF(AA330=\"UDINT\",\"\",\"\")))))) ))","v":""},{"$f":"IF(AA330=\"\",\"\",IF(AA330=\"BOOL\",\"\", IF(AA330=\"INT\",\"\",IF(AA330=\"DINT\",\"\",IF(AA330=\"UINT\",\"\",IF(AA330=\"REAL\",\"\",IF(AA330=\"Integer\",\"\",IF(AA330=\"UDINT\",\"\",\"\")))))) ))","v":""},{"$f":"IF(AA330=\"\",\"\",IF(AA330=\"BOOL\",\"\", IF(AA330=\"INT\",\"\",IF(AA330=\"DINT\",\"\",IF(AA330=\"UINT\",\"\",IF(AA330=\"REAL\",\"\",IF(AA330=\"Integer\",\"\",IF(AA330=\"UDINT\",\"\",\"\")))))) ))","v":""},{"$f":"IF(AA330=\"\",\"\",IF(AA330=\"BOOL\",\"\", IF(AA330=\"INT\",\"\",IF(AA330=\"DINT\",\"\",IF(AA330=\"UINT\",\"\",IF(AA330=\"REAL\",\"\",IF(AA330=\"Integer\",\"\",IF(AA330=\"UDINT\",\"\",\"\")))))) ))","v":""},{"$f":"IF(AA330=\"\",\"\",IF(AA330=\"BOOL\",\"\", IF(AA330=\"INT\",\"\",IF(AA330=\"DINT\",\"\",IF(AA330=\"UINT\",\"\",IF(AA330=\"REAL\",\"\",IF(AA330=\"Integer\",\"\",IF(AA330=\"UDINT\",\"\",\"\")))))) ))","v":""},{"$f":"IF(AA330=\"\",\"\",IF(AA330=\"BOOL\",\"\", IF(AA330=\"INT\",\"\",IF(AA330=\"DINT\",\"\",IF(AA330=\"UINT\",\"\",IF(AA330=\"REAL\",\"\",IF(AA330=\"Integer\",\"\",IF(AA330=\"UDINT\",\"\",\"\")))))) ))","v":""},{"$f":"IF(AA330=\"\",\"\",IF(AA330=\"BOOL\",\"\", IF(AA330=\"INT\",\"\",IF(AA330=\"DINT\",\"\",IF(AA330=\"UINT\",\"\",IF(AA330=\"REAL\",\"\",IF(AA330=\"Integer\",\"\",IF(AA330=\"UDINT\",\"\",\"\")))))) ))","v":""},{"$f":"IF(AA330=\"\",\"\",IF(AA330=\"BOOL\",\"\", IF(AA330=\"INT\",\"\",IF(AA330=\"DINT\",\"\",IF(AA330=\"UINT\",\"\",IF(AA330=\"REAL\",\"\",IF(AA330=\"Integer\",\"\",IF(AA330=\"UDINT\",\"\",\"\")))))) ))","v":""},{"$f":"IF(AA330=\"\",\"\",IF(AA330=\"BOOL\",\"\", IF(AA330=\"INT\",\"\",IF(AA330=\"DINT\",\"\",IF(AA330=\"UINT\",\"\",IF(AA330=\"REAL\",\"\",IF(AA330=\"Integer\",\"\",IF(AA330=\"UDINT\",\"\",\"\")))))) ))","v":""},{"$f":"IF(AA330=\"\",\"\",IF(AA330=\"BOOL\",\"\", IF(AA330=\"INT\",\"\",IF(AA330=\"DINT\",\"\",IF(AA330=\"UINT\",\"\",IF(AA330=\"REAL\",\"\",IF(AA330=\"Integer\",\"\",IF(AA330=\"UDINT\",\"\",\"\")))))) ))","v":""},{"$f":"IF(AA330=\"\",\"\",IF(AA330=\"BOOL\",\"\", IF(AA330=\"INT\",\"\",IF(AA330=\"DINT\",\"\",IF(AA330=\"UINT\",\"\",IF(AA330=\"REAL\",\"\",IF(AA330=\"Integer\",\"\",IF(AA330=\"UDINT\",\"\",\"\")))))) ))","v":""},{"$f":"IF(AA330=\"\",\"\",IF(AA330=\"BOOL\",\"\", IF(AA330=\"INT\",\"\",IF(AA330=\"DINT\",\"\",IF(AA330=\"UINT\",\"\",IF(AA330=\"REAL\",\"\",IF(AA330=\"Integer\",\"\",IF(AA330=\"UDINT\",\"\",\"\")))))) ))","v":""},{"$f":"IF(AA330=\"\",\"\",$V$12)","v":""},"",{"$f":"IF(AA330=\"\",\"\",IF( AA330=\"BOOL\",CONCATENATE(\"X\",\"0\"),\"\"))","v":""},{"$f":"IF(AA330=\"\",\"\",IF(AA330=\"BOOL\",\"\", IF(AA330=\"INT\",\"BIN\",IF(AA330=\"DINT\",\"BIN\",IF(AA330=\"UINT\",\"BIN\",IF(AA330=\"REAL\",\"\",IF(AA330=\"Integer\",\"BIN\",IF(AA330=\"UDINT\",\"BIN\",\"\")))))) ))","v":""},{"$f":"IF(AA330=\"\",\"\",IF(AA330=\"BOOL\",\"\", IF(AA330=\"INT\",\"2sComplement\",IF(AA330=\"DINT\",\"2sComplement\",IF(AA330=\"UINT\",\"Unsigned\",IF(AA330=\"REAL\",\"\",IF(AA330=\"Integer\",\"Unsigned\",IF(AA330=\"UDINT\",\"Unsigned\",\"\")))))) ))","v":""},{"$f":"IF(AA330=\"\",\"\",IF(AA330=\"BOOL\",\"\", IF(AA330=\"INT\",\"16Bits\",IF(AA330=\"DINT\",\"32Bits\",IF(AA330=\"UINT\",\"16Bits\",IF(AA330=\"REAL\",\"\",IF(AA330=\"Integer\",\"BitField\",IF(AA330=\"UDINT\",\"32Bits\",\"\")))))) ))","v":""},{"$f":"IF(AA330=\"\",\"\",IF(AA330=\"BOOL\",\"\", IF(AA330=\"INT\",\"\",IF(AA330=\"DINT\",\"\",IF(AA330=\"UINT\",\"\",IF(AA330=\"REAL\",\"\",IF(AA330=\"Integer\",\"0\",IF(AA330=\"UDINT\",\"\",\"\")))))) ))","v":""},{"$f":"IF(AA330=\"\",\"\",IF(AA330=\"BOOL\",\"\", IF(AA330=\"INT\",\"\",IF(AA330=\"DINT\",\"\",IF(AA330=\"UINT\",\"\",IF(AA330=\"REAL\",\"\",IF(AA330=\"Integer\",\"8\",IF(AA330=\"UDINT\",\"\",\"\")))))) ))","v":""},{"$f":"IF(AA330=\"\",\"\",IF(AA330=\"BOOL\",\"\", IF(AA330=\"INT\",\"Disable\",IF(AA330=\"DINT\",\"Disable\",IF(AA330=\"UINT\",\"Disable\",IF(AA330=\"REAL\",\"Disable\",IF(AA330=\"Integer\",\"Disable\",IF(AA330=\"UDINT\",\"Disable\",\"\")))))) ))","v":""},{"$f":"IF(AA330=\"\",\"\",IF(AA330=\"BOOL\",\"\", IF(AA330=\"INT\",\"\",IF(AA330=\"DINT\",\"\",IF(AA330=\"UINT\",\"\",IF(AA330=\"REAL\",\"\",IF(AA330=\"Integer\",\"\",IF(AA330=\"UDINT\",\"\",\"\")))))) ))","v":""},{"$f":"IF(AA330=\"\",\"\",IF(AA330=\"BOOL\",\"\", IF(AA330=\"INT\",\"\",IF(AA330=\"DINT\",\"\",IF(AA330=\"UINT\",\"\",IF(AA330=\"REAL\",\"\",IF(AA330=\"Integer\",\"\",IF(AA330=\"UDINT\",\"\",\"\")))))) ))","v":""},{"$f":"IF(AA330=\"\",\"\",IF(AA330=\"BOOL\",\"\", IF(AA330=\"INT\",\"Disable\",IF(AA330=\"DINT\",\"Disable\",IF(AA330=\"UINT\",\"Disable\",IF(AA330=\"REAL\",\"Disable\",IF(AA330=\"Integer\",\"Disable\",IF(AA330=\"UDINT\",\"Disable\",\"\")))))) ))","v":""},{"$f":"IF(AA330=\"\",\"\",IF(AA330=\"BOOL\",\"\", IF(AA330=\"INT\",\"\",IF(AA330=\"DINT\",\"\",IF(AA330=\"UINT\",\"\",IF(AA330=\"REAL\",\"\",IF(AA330=\"Integer\",\"\",IF(AA330=\"UDINT\",\"\",\"\")))))) ))","v":""},{"$f":"IF(AA330=\"\",\"\",IF(AA330=\"BOOL\",\"\", IF(AA330=\"INT\",\"\",IF(AA330=\"DINT\",\"\",IF(AA330=\"UINT\",\"\",IF(AA330=\"REAL\",\"\",IF(AA330=\"Integer\",\"\",IF(AA330=\"UDINT\",\"\",\"\")))))) ))","v":""},{"$f":"IF(AA330=\"\",\"\",IF(AA330=\"BOOL\",\"\", IF(AA330=\"INT\",\"\",IF(AA330=\"DINT\",\"\",IF(AA330=\"UINT\",\"\",IF(AA330=\"REAL\",\"\",IF(AA330=\"Integer\",\"\",IF(AA330=\"UDINT\",\"\",\"\")))))) ))","v":""},{"$f":"IF(AA330=\"\",\"\",IF(AA330=\"BOOL\",\"\", IF(AA330=\"INT\",\"\",IF(AA330=\"DINT\",\"\",IF(AA330=\"UINT\",\"\",IF(AA330=\"REAL\",\"\",IF(AA330=\"Integer\",\"\",IF(AA330=\"UDINT\",\"\",\"\")))))) ))","v":""},{"$f":"IF(AA330=\"\",\"\",IF(AA330=\"BOOL\",\"Disable\", IF(AA330=\"INT\",\"Disable\",IF(AA330=\"DINT\",\"Disable\",IF(AA330=\"UINT\",\"Disable\",IF(AA330=\"REAL\",\"Disable\",IF(AA330=\"Integer\",\"Disable\",IF(AA330=\"UDINT\",\"Disable\",\"\")))))) ))","v":""},{"$f":"IF(AA330=\"\",\"\",IF(AA330=\"BOOL\",\"\", IF(AA330=\"INT\",\"\",IF(AA330=\"DINT\",\"\",IF(AA330=\"UINT\",\"\",IF(AA330=\"REAL\",\"\",IF(AA330=\"Integer\",\"\",IF(AA330=\"UDINT\",\"\",\"\")))))) ))","v":""},{"$f":"IF(AA330=\"\",\"\",IF(AA330=\"BOOL\",\"\", IF(AA330=\"INT\",\"\",IF(AA330=\"DINT\",\"\",IF(AA330=\"UINT\",\"\",IF(AA330=\"REAL\",\"\",IF(AA330=\"Integer\",\"\",IF(AA330=\"UDINT\",\"\",\"\")))))) ))","v":""},{"$f":"IF(AA330=\"\",\"\",IF(AA330=\"BOOL\",\"None\", IF(AA330=\"INT\",\"None\",IF(AA330=\"DINT\",\"None\",IF(AA330=\"UINT\",\"None\",IF(AA330=\"REAL\",\"None\",IF(AA330=\"Integer\",\"None\",IF(AA330=\"UDINT\",\"None\",\"\")))))) ))","v":""},{"$f":"IF(AA330=\"\",\"\",IF(AA330=\"BOOL\",\"Disable\", IF(AA330=\"INT\",\"Disable\",IF(AA330=\"DINT\",\"Disable\",IF(AA330=\"UINT\",\"Disable\",IF(AA330=\"REAL\",\"Disable\",IF(AA330=\"Integer\",\"Disable\",IF(AA330=\"UDINT\",\"Disable\",\"\")))))) ))","v":""}]
[null,323,null,null,null,null,null,null,null,null,null,null,null,null,null,null,null,null,null,null,null,null,null,null,"","","","","","","","","","","","","","","","","","","","","","","","","","","","","","","","","","","","","","","","","","","","","",""]
[null,324,null,null,null,null,null,null,null,null,null,null,null,null,null,null,null,null,null,null,null,null,null,null,"","","","","","","","","","","","","","","","","","","","","","","","","","","","","","","","","","","","","","","","","","","","","",""]
[null,325,null,null,null,null,null,null,null,null,null,null,null,null,null,null,null,null,null,null,null,null,null,null,"","","","","","","","","","","","","","","","","","","","","","","","","","","","","","","","","","","","","","","","","","","","","",""]
[null,326,null,null,null,null,null,null,null,null,null,null,null,null,null,null,null,null,null,null,null,null,null,null,"","","","","","","","","","","","","","","","","","","","","","","","","","","","","","","","","","","","","","","","","","","","","",""]
[null,327,null,null,null,null,null,null,null,null,null,null,null,null,null,null,null,null,null,null,null,null,null,null,"","","","","","","","","","","","","","","","","","","","","","","","","","","","","","","","","","","","","","","","","","","","","",""]
[null,328,null,null,null,null,null,null,null,null,null,null,null,null,null,null,null,null,null,null,null,null,null,null,"","","","","","","","","","","","","","","","","","","","","","","","","","","","","","","","","","","","","","","","","","","","","",""]
[null,329,null,null,null,null,null,null,null,null,null,null,null,null,null,null,null,null,null,null,null,null,null,null,"","","","","","","","","","","","","","","","","","","","","","","","","","","","","","","","","","","","","","","","","","","","","",""]
[null,330,null,null,null,null,null,null,null,null,null,null,null,null,null,null,null,null,null,null,null,null,null,null,"","","","","","","","","","","","","","","","","","","","","","","","","","","","","","","","","","","","","","","","","","","","","",""]
[null,331,null,null,null,null,null,null,null,null,null,null,null,null,null,null,null,null,null,null,null,null,null,null,"","","","","","","","","","","","","","","","","","","","","","","","","","","","","","","","","","","","","","","","","","","","","",""]
[null,332,null,null,null,null,null,null,null,null,null,null,null,null,null,null,null,null,null,null,null,null,null,null,"","","","","","","","","","","","","","","","","","","","","","","","","","","","","","","","","","","","","","","","","","","","","",""]
[null,333,null,null,null,null,null,null,null,null,null,null,null,null,null,null,null,null,null,null,null,null,null,null,"","","","","","","","","","","","","","","","","","","","","","","","","","","","","","","","","","","","","","","","","","","","","",""]
[null,334,null,null,null,null,null,null,null,null,null,null,null,null,null,null,null,null,null,null,null,null,null,null,"","","","","","","","","","","","","","","","","","","","","","","","","","","","","","","","","","","","","","","","","","","","","",""]
[null,335,null,null,null,null,null,null,null,null,null,null,null,null,null,null,null,null,null,null,null,null,null,null,"","","","","","","","","","","","","","","","","","","","","","","","","","","","","","","","","","","","","","","","","","","","","",""]
[null,336,null,null,null,null,null,null,null,null,null,null,null,null,null,null,null,null,null,null,null,null,null,null,"","","","","","","","","","","","","","","","","","","","","","","","","","","","","","","","","","","","","","","","","","","","","",""]
[null,337,null,null,null,null,null,null,null,null,null,null,null,null,null,null,null,null,null,null,null,null,null,null,"","","","","","","","","","","","","","","","","","","","","","","","","","","","","","","","","","","","","","","","","","","","","",""]
[null,338,null,null,null,null,null,null,null,null,null,null,null,null,null,null,null,null,null,null,null,null,null,null,"","","","","","","","","","","","","","","","","","","","","","","","","","","","","","","","","","","","","","","","","","","","","",""]
[null,339,null,null,null,null,null,null,null,null,null,null,null,null,null,null,null,null,null,null,null,null,null,null,"","","","","","","","","","","","","","","","","","","","","","","","","","","","","","","","","","","","","","","","","","","","","",""]
[null,340,null,null,null,null,null,null,null,null,null,null,null,null,null,null,null,null,null,null,null,null,null,null,"","","","","","","","","","","","","","","","","","","","","","","","","","","","","","","","","","","","","","","","","","","","","",""]
[null,341,null,null,null,null,null,null,null,null,null,null,null,null,null,null,null,null,null,null,null,null,null,null,"","","","","","","","","","","","","","","","","","","","","","","","","","","","","","","","","","","","","","","","","","","","","",""]
[null,342,null,null,null,null,null,null,null,null,null,null,null,null,null,null,null,null,null,null,null,null,null,null,"","","","","","","","","","","","","","","","","","","","","","","","","","","","","","","","","","","","","","","","","","","","","",""]
[null,343,null,null,null,null,null,null,null,null,null,null,null,null,null,null,null,null,null,null,null,null,null,null,"","","","","","","","","","","","","","","","","","","","","","","","","","","","","","","","","","","","","","","","","","","","","",""]
[null,344,null,null,null,null,null,null,null,null,null,null,null,null,null,null,null,null,null,null,null,null,null,null,"","","","","","","","","","","","","","","","","","","","","","","","","","","","","","","","","","","","","","","","","","","","","",""]
[null,345,null,null,null,null,null,null,null,null,null,null,null,null,null,null,null,null,null,null,null,null,null,null,"","","","","","","","","","","","","","","","","","","","","","","","","","","","","","","","","","","","","","","","","","","","","",""]
[null,346,null,null,null,null,null,null,null,null,null,null,null,null,null,null,null,null,null,null,null,null,null,null,"","","","","","","","","","","","","","","","","","","","","","","","","","","","","","","","","","","","","","","","","","","","","",""]
[null,347,null,null,null,null,null,null,null,null,null,null,null,null,null,null,null,null,null,null,null,null,null,null,"","","","","","","","","","","","","","","","","","","","","","","","","","","","","","","","","","","","","","","","","","","","","",""]
[null,348,null,null,null,null,null,null,null,null,null,null,null,null,null,null,null,null,null,null,null,null,null,null,"","","","","","","","","","","","","","","","","","","","","","","","","","","","","","","","","","","","","","","","","","","","","",""]
[null,349,null,null,null,null,null,null,null,null,null,null,null,null,null,null,null,null,null,null,null,null,null,null,"","","","","","","","","","","","","","","","","","","","","","","","","","","","","","","","","","","","","","","","","","","","","",""]
[null,350,null,null,null,null,null,null,null,null,null,null,null,null,null,null,null,null,null,null,null,null,null,null,"","","","","","","","","","","","","","","","","","","","","","","","","","","","","","","","","","","","","","","","","","","","","",""]
[null,351,null,null,null,null,null,null,null,null,null,null,null,null,null,null,null,null,null,null,null,null,null,null,"","","","","","","","","","","","","","","","","","","","","","","","","","","","","","","","","","","","","","","","","","","","","",""]
[null,352,null,null,null,null,null,null,null,null,null,null,null,null,null,null,null,null,null,null,null,null,null,null,"","","","","","","","","","","","","","","","","","","","","","","","","","","","","","","","","","","","","","","","","","","","","",""]
[null,353,null,null,null,null,null,null,null,null,null,null,null,null,null,null,null,null,null,null,null,null,null,null,"","","","","","","","","","","","","","","","","","","","","","","","","","","","","","","","","","","","","","","","","","","","","",""]
[null,354,null,null,null,null,null,null,null,null,null,null,null,null,null,null,null,null,null,null,null,null,null,null,"","","","","","","","","","","","","","","","","","","","","","","","","","","","","","","","","","","","","","","","","","","","","",""]
[null,355,null,null,null,null,null,null,null,null,null,null,null,null,null,null,null,null,null,null,null,null,null,null,"","","","","","","","","","","","","","","","","","","","","","","","","","","","","","","","","","","","","","","","","","","","","",""]
[null,356,null,null,null,null,null,null,null,null,null,null,null,null,null,null,null,null,null,null,null,null,null,null,"","","","","","","","","","","","","","","","","","","","","","","","","","","","","","","","","","","","","","","","","","","","","",""]
[null,357,null,null,null,null,null,null,null,null,null,null,null,null,null,null,null,null,null,null,null,null,null,null,"","","","","","","","","","","","","","","","","","","","","","","","","","","","","","","","","","","","","","","","","","","","","",""]
[null,358,null,null,null,null,null,null,null,null,null,null,null,null,null,null,null,null,null,null,null,null,null,null,"","","","","","","","","","","","","","","","","","","","","","","","","","","","","","","","","","","","","","","","","","","","","",""]
[null,359,null,null,null,null,null,null,null,null,null,null,null,null,null,null,null,null,null,null,null,null,null,null,"","","","","","","","","","","","","","","","","","","","","","","","","","","","","","","","","","","","","","","","","","","","","",""]
[null,360,null,null,null,null,null,null,null,null,null,null,null,null,null,null,null,null,null,null,null,null,null,null,"","","","","","","","","","","","","","","","","","","","","","","","","","","","","","","","","","","","","","","","","","","","","",""]
[null,361,null,null,null,null,null,null,null,null,null,null,null,null,null,null,null,null,null,null,null,null,null,null,"","","","","","","","","","","","","","","","","","","","","","","","","","","","","","","","","","","","","","","","","","","","","",""]
[null,362,null,null,null,null,null,null,null,null,null,null,null,null,null,null,null,null,null,null,null,null,null,null,"","","","","","","","","","","","","","","","","","","","","","","","","","","","","","","","","","","","","","","","","","","","","",""]
[null,363,null,null,null,null,null,null,null,null,null,null,null,null,null,null,null,null,null,null,null,null,null,null,"","","","","","","","","","","","","","","","","","","","","","","","","","","","","","","","","","","","","","","","","","","","","",""]
[null,364,null,null,null,null,null,null,null,null,null,null,null,null,null,null,null,null,null,null,null,null,null,null,"","","","","","","","","","","","","","","","","","","","","","","","","","","","","","","","","","","","","","","","","","","","","",""]
[null,365,null,null,null,null,null,null,null,null,null,null,null,null,null,null,null,null,null,null,null,null,null,null,"","","","","","","","","","","","","","","","","","","","","","","","","","","","","","","","","","","","","","","","","","","","","",""]
[null,366,null,null,null,null,null,null,null,null,null,null,null,null,null,null,null,null,null,null,null,null,null,null,"","","","","","","","","","","","","","","","","","","","","","","","","","","","","","","","","","","","","","","","","","","","","",""]
[null,367,null,null,null,null,null,null,null,null,null,null,null,null,null,null,null,null,null,null,null,null,null,null,"","","","","","","","","","","","","","","","","","","","","","","","","","","","","","","","","","","","","","","","","","","","","",""]
[null,368,null,null,null,null,null,null,null,null,null,null,null,null,null,null,null,null,null,null,null,null,null,null,"","","","","","","","","","","","","","","","","","","","","","","","","","","","","","","","","","","","","","","","","","","","","",""]
[null,369,null,null,null,null,null,null,null,null,null,null,null,null,null,null,null,null,null,null,null,null,null,null,"","","","","","","","","","","","","","","","","","","","","","","","","","","","","","","","","","","","","","","","","","","","","",""]
[null,370,null,null,null,null,null,null,null,null,null,null,null,null,null,null,null,null,null,null,null,null,null,null,"","","","","","","","","","","","","","","","","","","","","","","","","","","","","","","","","","","","","","","","","","","","","",""]
[null,371,null,null,null,null,null,null,null,null,null,null,null,null,null,null,null,null,null,null,null,null,null,null,"","","","","","","","","","","","","","","","","","","","","","","","","","","","","","","","","","","","","","","","","","","","","",""]
[null,372,null,null,null,null,null,null,null,null,null,null,null,null,null,null,null,null,null,null,null,null,null,null,"","","","","","","","","","","","","","","","","","","","","","","","","","","","","","","","","","","","","","","","","","","","","",""]
[null,373,null,null,null,null,null,null,null,null,null,null,null,null,null,null,null,null,null,null,null,null,null,null,"","","","","","","","","","","","","","","","","","","","","","","","","","","","","","","","","","","","","","","","","","","","","",""]
[null,374,null,null,null,null,null,null,null,null,null,null,null,null,null,null,null,null,null,null,null,null,null,null,"","","","","","","","","","","","","","","","","","","","","","","","","","","","","","","","","","","","","","","","","","","","","",""]
[null,375,null,null,null,null,null,null,null,null,null,null,null,null,null,null,null,null,null,null,null,null,null,null,"","","","","","","","","","","","","","","","","","","","","","","","","","","","","","","","","","","","","","","","","","","","","",""]
[null,376,null,null,null,null,null,null,null,null,null,null,null,null,null,null,null,null,null,null,null,null,null,null,"","","","","","","","","","","","","","","","","","","","","","","","","","","","","","","","","","","","","","","","","","","","","",""]
[null,377,null,null,null,null,null,null,null,null,null,null,null,null,null,null,null,null,null,null,null,null,null,null,"","","","","","","","","","","","","","","","","","","","","","","","","","","","","","","","","","","","","","","","","","","","","",""]
[null,378,null,null,null,null,null,null,null,null,null,null,null,null,null,null,null,null,null,null,null,null,null,null,"","","","","","","","","","","","","","","","","","","","","","","","","","","","","","","","","","","","","","","","","","","","","",""]
[null,379,null,null,null,null,null,null,null,null,null,null,null,null,null,null,null,null,null,null,null,null,null,null,"","","","","","","","","","","","","","","","","","","","","","","","","","","","","","","","","","","","","","","","","","","","","",""]
[null,380,null,null,null,null,null,null,null,null,null,null,null,null,null,null,null,null,null,null,null,null,null,null,"","","","","","","","","","","","","","","","","","","","","","","","","","","","","","","","","","","","","","","","","","","","","",""]
[null,381,null,null,null,null,null,null,null,null,null,null,null,null,null,null,null,null,null,null,null,null,null,null,"","","","","","","","","","","","","","","","","","","","","","","","","","","","","","","","","","","","","","","","","","","","","",""]
[null,382,null,null,null,null,null,null,null,null,null,null,null,null,null,null,null,null,null,null,null,null,null,null,"","","","","","","","","","","","","","","","","","","","","","","","","","","","","","","","","","","","","","","","","","","","","",""]
[null,383,null,null,null,null,null,null,null,null,null,null,null,null,null,null,null,null,null,null,null,null,null,null,"","","","","","","","","","","","","","","","","","","","","","","","","","","","","","","","","","","","","","","","","","","","","",""]
[null,384,null,null,null,null,null,null,null,null,null,null,null,null,null,null,null,null,null,null,null,null,null,null,"","","","","","","","","","","","","","","","","","","","","","","","","","","","","","","","","","","","","","","","","","","","","",""]
[null,385,null,null,null,null,null,null,null,null,null,null,null,null,null,null,null,null,null,null,null,null,null,null,"",{"$f":"IF(F392=\"\",\"\",CONCATENATE($V$7,\".\",F392))","v":""},{"$f":"IF(H392=\"\",\"\",IF(H392=\"BYTE\",\"Integer\",IF(H392=\"WORD\",\"UINT\",IF(H392=\"DWORD\",\"UDINT\",H392))))","v":""},"","",{"$f":"IF(F392=\"\",\"\",CONCATENATE(R392))","v":""},"","","","","","","","","","","","","","","","","","","","",{"$f":"IF(AA393=\"\",\"\",CONCATENATE(\"%MW\",E392))","v":""},"","","","","","","","","","","","","","","","","","",""]
[null,386,null,null,null,null,null,null,null,null,null,null,null,null,null,null,null,null,null,null,null,null,null,null,{"$f":"IF(IFERROR(Z394,\"\")=\"\",\"\",\"Variable\")","v":""},"","",{"$f":"IF(AA394=\"\",\"\",$V$8)","v":""},{"$f":"IF(AA394=\"\",\"\",$V$13)","v":""},"",{"$f":"IF(AA394=\"\",\"\",J393)","v":""},{"$f":"IF(AA394=\"\",\"\",IF(AA394=\"BOOL\",\"\", IF(AA394=\"INT\",\"\",IF(AA394=\"DINT\",\"\",IF(AA394=\"UINT\",\"\",IF(AA394=\"REAL\",\"\",IF(AA394=\"Integer\",\"\",IF(AA394=\"UDINT\",\"\",\"\")))))) ))","v":""},{"$f":"IF(AA394=\"\",\"\",$V$9)","v":""},{"$f":"IF(AA394=\"\",\"\",$V$10)","v":""},{"$f":"IF(AA394=\"\",\"\",$V$11)","v":""},{"$f":"IF(AA394=\"\",\"\",IF(AA394=\"BOOL\",\"\", IF(AA394=\"INT\",\"\",IF(AA394=\"DINT\",\"\",IF(AA394=\"UINT\",\"\",IF(AA394=\"REAL\",\"\",IF(AA394=\"Integer\",\"\",IF(AA394=\"UDINT\",\"\",\"\")))))) ))","v":""},{"$f":"IF(AA394=\"\",\"\",IF(AA394=\"BOOL\",\"\", IF(AA394=\"INT\",\"\",IF(AA394=\"DINT\",\"\",IF(AA394=\"UINT\",\"\",IF(AA394=\"REAL\",\"\",IF(AA394=\"Integer\",\"\",IF(AA394=\"UDINT\",\"\",\"\")))))) ))","v":""},{"$f":"IF(AA394=\"\",\"\",IF(AA394=\"BOOL\",\"\", IF(AA394=\"INT\",\"\",IF(AA394=\"DINT\",\"\",IF(AA394=\"UINT\",\"\",IF(AA394=\"REAL\",\"\",IF(AA394=\"Integer\",\"\",IF(AA394=\"UDINT\",\"\",\"\")))))) ))","v":""},{"$f":"IF(AA394=\"\",\"\",IF(AA394=\"BOOL\",\"\", IF(AA394=\"INT\",\"\",IF(AA394=\"DINT\",\"\",IF(AA394=\"UINT\",\"\",IF(AA394=\"REAL\",\"\",IF(AA394=\"Integer\",\"\",IF(AA394=\"UDINT\",\"\",\"\")))))) ))","v":""},{"$f":"IF(AA394=\"\",\"\",IF(AA394=\"BOOL\",\"\", IF(AA394=\"INT\",\"\",IF(AA394=\"DINT\",\"\",IF(AA394=\"UINT\",\"\",IF(AA394=\"REAL\",\"\",IF(AA394=\"Integer\",\"\",IF(AA394=\"UDINT\",\"\",\"\")))))) ))","v":""},{"$f":"IF(AA394=\"\",\"\",IF(AA394=\"BOOL\",\"\", IF(AA394=\"INT\",\"\",IF(AA394=\"DINT\",\"\",IF(AA394=\"UINT\",\"\",IF(AA394=\"REAL\",\"\",IF(AA394=\"Integer\",\"\",IF(AA394=\"UDINT\",\"\",\"\")))))) ))","v":""},{"$f":"IF(AA394=\"\",\"\",IF(AA394=\"BOOL\",\"\", IF(AA394=\"INT\",\"\",IF(AA394=\"DINT\",\"\",IF(AA394=\"UINT\",\"\",IF(AA394=\"REAL\",\"\",IF(AA394=\"Integer\",\"\",IF(AA394=\"UDINT\",\"\",\"\")))))) ))","v":""},{"$f":"IF(AA394=\"\",\"\",IF(AA394=\"BOOL\",\"\", IF(AA394=\"INT\",\"\",IF(AA394=\"DINT\",\"\",IF(AA394=\"UINT\",\"\",IF(AA394=\"REAL\",\"\",IF(AA394=\"Integer\",\"\",IF(AA394=\"UDINT\",\"\",\"\")))))) ))","v":""},{"$f":"IF(AA394=\"\",\"\",IF(AA394=\"BOOL\",\"\", IF(AA394=\"INT\",\"\",IF(AA394=\"DINT\",\"\",IF(AA394=\"UINT\",\"\",IF(AA394=\"REAL\",\"\",IF(AA394=\"Integer\",\"\",IF(AA394=\"UDINT\",\"\",\"\")))))) ))","v":""},{"$f":"IF(AA394=\"\",\"\",IF(AA394=\"BOOL\",\"\", IF(AA394=\"INT\",\"\",IF(AA394=\"DINT\",\"\",IF(AA394=\"UINT\",\"\",IF(AA394=\"REAL\",\"\",IF(AA394=\"Integer\",\"\",IF(AA394=\"UDINT\",\"\",\"\")))))) ))","v":""},{"$f":"IF(AA394=\"\",\"\",IF(AA394=\"BOOL\",\"\", IF(AA394=\"INT\",\"\",IF(AA394=\"DINT\",\"\",IF(AA394=\"UINT\",\"\",IF(AA394=\"REAL\",\"\",IF(AA394=\"Integer\",\"\",IF(AA394=\"UDINT\",\"\",\"\")))))) ))","v":""},{"$f":"IF(AA394=\"\",\"\",IF(AA394=\"BOOL\",\"\", IF(AA394=\"INT\",\"\",IF(AA394=\"DINT\",\"\",IF(AA394=\"UINT\",\"\",IF(AA394=\"REAL\",\"\",IF(AA394=\"Integer\",\"\",IF(AA394=\"UDINT\",\"\",\"\")))))) ))","v":""},{"$f":"IF(AA394=\"\",\"\",IF(AA394=\"BOOL\",\"\", IF(AA394=\"INT\",\"\",IF(AA394=\"DINT\",\"\",IF(AA394=\"UINT\",\"\",IF(AA394=\"REAL\",\"\",IF(AA394=\"Integer\",\"\",IF(AA394=\"UDINT\",\"\",\"\")))))) ))","v":""},{"$f":"IF(AA394=\"\",\"\",IF(AA394=\"BOOL\",\"\", IF(AA394=\"INT\",\"\",IF(AA394=\"DINT\",\"\",IF(AA394=\"UINT\",\"\",IF(AA394=\"REAL\",\"\",IF(AA394=\"Integer\",\"\",IF(AA394=\"UDINT\",\"\",\"\")))))) ))","v":""},{"$f":"IF(AA394=\"\",\"\",$V$12)","v":""},"",{"$f":"IF(AA394=\"\",\"\",IF( AA394=\"BOOL\",CONCATENATE(\"X\",\"0\"),\"\"))","v":""},{"$f":"IF(AA394=\"\",\"\",IF(AA394=\"BOOL\",\"\", IF(AA394=\"INT\",\"BIN\",IF(AA394=\"DINT\",\"BIN\",IF(AA394=\"UINT\",\"BIN\",IF(AA394=\"REAL\",\"\",IF(AA394=\"Integer\",\"BIN\",IF(AA394=\"UDINT\",\"BIN\",\"\")))))) ))","v":""},{"$f":"IF(AA394=\"\",\"\",IF(AA394=\"BOOL\",\"\", IF(AA394=\"INT\",\"2sComplement\",IF(AA394=\"DINT\",\"2sComplement\",IF(AA394=\"UINT\",\"Unsigned\",IF(AA394=\"REAL\",\"\",IF(AA394=\"Integer\",\"Unsigned\",IF(AA394=\"UDINT\",\"Unsigned\",\"\")))))) ))","v":""},{"$f":"IF(AA394=\"\",\"\",IF(AA394=\"BOOL\",\"\", IF(AA394=\"INT\",\"16Bits\",IF(AA394=\"DINT\",\"32Bits\",IF(AA394=\"UINT\",\"16Bits\",IF(AA394=\"REAL\",\"\",IF(AA394=\"Integer\",\"BitField\",IF(AA394=\"UDINT\",\"32Bits\",\"\")))))) ))","v":""},{"$f":"IF(AA394=\"\",\"\",IF(AA394=\"BOOL\",\"\", IF(AA394=\"INT\",\"\",IF(AA394=\"DINT\",\"\",IF(AA394=\"UINT\",\"\",IF(AA394=\"REAL\",\"\",IF(AA394=\"Integer\",\"0\",IF(AA394=\"UDINT\",\"\",\"\")))))) ))","v":""},{"$f":"IF(AA394=\"\",\"\",IF(AA394=\"BOOL\",\"\", IF(AA394=\"INT\",\"\",IF(AA394=\"DINT\",\"\",IF(AA394=\"UINT\",\"\",IF(AA394=\"REAL\",\"\",IF(AA394=\"Integer\",\"8\",IF(AA394=\"UDINT\",\"\",\"\")))))) ))","v":""},{"$f":"IF(AA394=\"\",\"\",IF(AA394=\"BOOL\",\"\", IF(AA394=\"INT\",\"Disable\",IF(AA394=\"DINT\",\"Disable\",IF(AA394=\"UINT\",\"Disable\",IF(AA394=\"REAL\",\"Disable\",IF(AA394=\"Integer\",\"Disable\",IF(AA394=\"UDINT\",\"Disable\",\"\")))))) ))","v":""},{"$f":"IF(AA394=\"\",\"\",IF(AA394=\"BOOL\",\"\", IF(AA394=\"INT\",\"\",IF(AA394=\"DINT\",\"\",IF(AA394=\"UINT\",\"\",IF(AA394=\"REAL\",\"\",IF(AA394=\"Integer\",\"\",IF(AA394=\"UDINT\",\"\",\"\")))))) ))","v":""},{"$f":"IF(AA394=\"\",\"\",IF(AA394=\"BOOL\",\"\", IF(AA394=\"INT\",\"\",IF(AA394=\"DINT\",\"\",IF(AA394=\"UINT\",\"\",IF(AA394=\"REAL\",\"\",IF(AA394=\"Integer\",\"\",IF(AA394=\"UDINT\",\"\",\"\")))))) ))","v":""},{"$f":"IF(AA394=\"\",\"\",IF(AA394=\"BOOL\",\"\", IF(AA394=\"INT\",\"Disable\",IF(AA394=\"DINT\",\"Disable\",IF(AA394=\"UINT\",\"Disable\",IF(AA394=\"REAL\",\"Disable\",IF(AA394=\"Integer\",\"Disable\",IF(AA394=\"UDINT\",\"Disable\",\"\")))))) ))","v":""},{"$f":"IF(AA394=\"\",\"\",IF(AA394=\"BOOL\",\"\", IF(AA394=\"INT\",\"\",IF(AA394=\"DINT\",\"\",IF(AA394=\"UINT\",\"\",IF(AA394=\"REAL\",\"\",IF(AA394=\"Integer\",\"\",IF(AA394=\"UDINT\",\"\",\"\")))))) ))","v":""},{"$f":"IF(AA394=\"\",\"\",IF(AA394=\"BOOL\",\"\", IF(AA394=\"INT\",\"\",IF(AA394=\"DINT\",\"\",IF(AA394=\"UINT\",\"\",IF(AA394=\"REAL\",\"\",IF(AA394=\"Integer\",\"\",IF(AA394=\"UDINT\",\"\",\"\")))))) ))","v":""},{"$f":"IF(AA394=\"\",\"\",IF(AA394=\"BOOL\",\"\", IF(AA394=\"INT\",\"\",IF(AA394=\"DINT\",\"\",IF(AA394=\"UINT\",\"\",IF(AA394=\"REAL\",\"\",IF(AA394=\"Integer\",\"\",IF(AA394=\"UDINT\",\"\",\"\")))))) ))","v":""},{"$f":"IF(AA394=\"\",\"\",IF(AA394=\"BOOL\",\"\", IF(AA394=\"INT\",\"\",IF(AA394=\"DINT\",\"\",IF(AA394=\"UINT\",\"\",IF(AA394=\"REAL\",\"\",IF(AA394=\"Integer\",\"\",IF(AA394=\"UDINT\",\"\",\"\")))))) ))","v":""},{"$f":"IF(AA394=\"\",\"\",IF(AA394=\"BOOL\",\"Disable\", IF(AA394=\"INT\",\"Disable\",IF(AA394=\"DINT\",\"Disable\",IF(AA394=\"UINT\",\"Disable\",IF(AA394=\"REAL\",\"Disable\",IF(AA394=\"Integer\",\"Disable\",IF(AA394=\"UDINT\",\"Disable\",\"\")))))) ))","v":""},{"$f":"IF(AA394=\"\",\"\",IF(AA394=\"BOOL\",\"\", IF(AA394=\"INT\",\"\",IF(AA394=\"DINT\",\"\",IF(AA394=\"UINT\",\"\",IF(AA394=\"REAL\",\"\",IF(AA394=\"Integer\",\"\",IF(AA394=\"UDINT\",\"\",\"\")))))) ))","v":""},{"$f":"IF(AA394=\"\",\"\",IF(AA394=\"BOOL\",\"\", IF(AA394=\"INT\",\"\",IF(AA394=\"DINT\",\"\",IF(AA394=\"UINT\",\"\",IF(AA394=\"REAL\",\"\",IF(AA394=\"Integer\",\"\",IF(AA394=\"UDINT\",\"\",\"\")))))) ))","v":""},{"$f":"IF(AA394=\"\",\"\",IF(AA394=\"BOOL\",\"None\", IF(AA394=\"INT\",\"None\",IF(AA394=\"DINT\",\"None\",IF(AA394=\"UINT\",\"None\",IF(AA394=\"REAL\",\"None\",IF(AA394=\"Integer\",\"None\",IF(AA394=\"UDINT\",\"None\",\"\")))))) ))","v":""},{"$f":"IF(AA394=\"\",\"\",IF(AA394=\"BOOL\",\"Disable\", IF(AA394=\"INT\",\"Disable\",IF(AA394=\"DINT\",\"Disable\",IF(AA394=\"UINT\",\"Disable\",IF(AA394=\"REAL\",\"Disable\",IF(AA394=\"Integer\",\"Disable\",IF(AA394=\"UDINT\",\"Disable\",\"\")))))) ))","v":""}]
[null,387,null,null,null,null,null,null,null,null,null,null,null,null,null,null,null,null,null,null,null,null,null,null,"","","","","","","","","","","","","","","","","","","","","","","","","","","","","","","","","","","","","","","","","","","","","",""]
[null,388,null,null,null,null,null,null,null,null,null,null,null,null,null,null,null,null,null,null,null,null,null,null,"","","","","","","","","","","","","","","","","","","","","","","","","","","","","","","","","","","","","","","","","","","","","",""]
[null,389,null,null,null,null,null,null,null,null,null,null,null,null,null,null,null,null,null,null,null,null,null,null,"","","","","","","","","","","","","","","","","","","","","","","","","","","","","","","","","","","","","","","","","","","","","",""]
[null,390,null,null,null,null,null,null,null,null,null,null,null,null,null,null,null,null,null,null,null,null,null,null,"","","","","","","","","","","","","","","","","","","","","","","","","","","","","","","","","","","","","","","","","","","","","",""]
[null,391,null,null,null,null,null,null,null,null,null,null,null,null,null,null,null,null,null,null,null,null,null,null,"","","","","","","","","","","","","","","","","","","","","","","","","","","","","","","","","","","","","","","","","","","","","",""]
[null,392,null,null,null,null,null,null,null,null,null,null,null,null,null,null,null,null,null,null,null,null,null,null,"","","","","","","","","","","","","","","","","","","","","","","","","","","","","","","","","","","","","","","","","","","","","",""]
[null,393,null,null,null,null,null,null,null,null,null,null,null,null,null,null,null,null,null,null,null,null,null,null,"","","","","","","","","","","","","","","","","","","","","","","","","","","","","","","","","","","","","","","","","","","","","",""]
[null,394,null,null,null,null,null,null,null,null,null,null,null,null,null,null,null,null,null,null,null,null,null,null,"","","","","","","","","","","","","","","","","","","","","","","","","","","","","","","","","","","","","","","","","","","","","",""]
[null,395,null,null,null,null,null,null,null,null,null,null,null,null,null,null,null,null,null,null,null,null,null,null,"","","","","","","","","","","","","","","","","","","","","","","","","","","","","","","","","","","","","","","","","","","","","",""]
[null,396,null,null,null,null,null,null,null,null,null,null,null,null,null,null,null,null,null,null,null,null,null,null,"","","","","","","","","","","","","","","","","","","","","","","","","","","","","","","","","","","","","","","","","","","","","",""]
[null,397,null,null,null,null,null,null,null,null,null,null,null,null,null,null,null,null,null,null,null,null,null,null,"","","","","","","","","","","","","","","","","","","","","","","","","","","","","","","","","","","","","","","","","","","","","",""]
[null,398,null,null,null,null,null,null,null,null,null,null,null,null,null,null,null,null,null,null,null,null,null,null,"","","","","","","","","","","","","","","","","","","","","","","","","","","","","","","","","","","","","","","","","","","","","",""]
[null,399,null,null,null,null,null,null,null,null,null,null,null,null,null,null,null,null,null,null,null,null,null,null,"","","","","","","","","","","","","","","","","","","","","","","","","","","","","","","","","","","","","","","","","","","","","",""]
[null,400,null,null,null,null,null,null,null,null,null,null,null,null,null,null,null,null,null,null,null,null,null,null,"","","","","","","","","","","","","","","","","","","","","","","","","","","","","","","","","","","","","","","","","","","","","",""]
[null,401,null,null,null,null,null,null,null,null,null,null,null,null,null,null,null,null,null,null,null,null,null,null,"","","","","","","","","","","","","","","","","","","","","","","","","","","","","","","","","","","","","","","","","","","","","",""]
[null,402,null,null,null,null,null,null,null,null,null,null,null,null,null,null,null,null,null,null,null,null,null,null,"","","","","","","","","","","","","","","","","","","","","","","","","","","","","","","","","","","","","","","","","","","","","",""]
[null,403,null,null,null,null,null,null,null,null,null,null,null,null,null,null,null,null,null,null,null,null,null,null,"","","","","","","","","","","","","","","","","","","","","","","","","","","","","","","","","","","","","","","","","","","","","",""]
[null,404,null,null,null,null,null,null,null,null,null,null,null,null,null,null,null,null,null,null,null,null,null,null,"","","","","","","","","","","","","","","","","","","","","","","","","","","","","","","","","","","","","","","","","","","","","",""]
[null,405,null,null,null,null,null,null,null,null,null,null,null,null,null,null,null,null,null,null,null,null,null,null,"","","","","","","","","","","","","","","","","","","","","","","","","","","","","","","","","","","","","","","","","","","","","",""]
[null,406,null,null,null,null,null,null,null,null,null,null,null,null,null,null,null,null,null,null,null,null,null,null,"","","","","","","","","","","","","","","","","","","","","","","","","","","","","","","","","","","","","","","","","","","","","",""]
[null,407,null,null,null,null,null,null,null,null,null,null,null,null,null,null,null,null,null,null,null,null,null,null,"","","","","","","","","","","","","","","","","","","","","","","","","","","","","","","","","","","","","","","","","","","","","",""]
[null,408,null,null,null,null,null,null,null,null,null,null,null,null,null,null,null,null,null,null,null,null,null,null,"","","","","","","","","","","","","","","","","","","","","","","","","","","","","","","","","","","","","","","","","","","","","",""]
[null,409,null,null,null,null,null,null,null,null,null,null,null,null,null,null,null,null,null,null,null,null,null,null,"","","","","","","","","","","","","","","","","","","","","","","","","","","","","","","","","","","","","","","","","","","","","",""]
[null,410,null,null,null,null,null,null,null,null,null,null,null,null,null,null,null,null,null,null,null,null,null,null,"","","","","","","","","","","","","","","","","","","","","","","","","","","","","","","","","","","","","","","","","","","","","",""]
[null,411,null,null,null,null,null,null,null,null,null,null,null,null,null,null,null,null,null,null,null,null,null,null,"","","","","","","","","","","","","","","","","","","","","","","","","","","","","","","","","","","","","","","","","","","","","",""]
[null,412,null,null,null,null,null,null,null,null,null,null,null,null,null,null,null,null,null,null,null,null,null,null,"","","","","","","","","","","","","","","","","","","","","","","","","","","","","","","","","","","","","","","","","","","","","",""]
[null,413,null,null,null,null,null,null,null,null,null,null,null,null,null,null,null,null,null,null,null,null,null,null,"","","","","","","","","","","","","","","","","","","","","","","","","","","","","","","","","","","","","","","","","","","","","",""]
[null,414,null,null,null,null,null,null,null,null,null,null,null,null,null,null,null,null,null,null,null,null,null,null,"","","","","","","","","","","","","","","","","","","","","","","","","","","","","","","","","","","","","","","","","","","","","",""]
[null,415,null,null,null,null,null,null,null,null,null,null,null,null,null,null,null,null,null,null,null,null,null,null,"","","","","","","","","","","","","","","","","","","","","","","","","","","","","","","","","","","","","","","","","","","","","",""]
[null,416,null,null,null,null,null,null,null,null,null,null,null,null,null,null,null,null,null,null,null,null,null,null,"","","","","","","","","","","","","","","","","","","","","","","","","","","","","","","","","","","","","","","","","","","","","",""]
[null,417,null,null,null,null,null,null,null,null,null,null,null,null,null,null,null,null,null,null,null,null,null,null,"","","","","","","","","","","","","","","","","","","","","","","","","","","","","","","","","","","","","","","","","","","","","",""]
[null,418,null,null,null,null,null,null,null,null,null,null,null,null,null,null,null,null,null,null,null,null,null,null,"","","","","","","","","","","","","","","","","","","","","","","","","","","","","","","","","","","","","","","","","","","","","",""]
[null,419,null,null,null,null,null,null,null,null,null,null,null,null,null,null,null,null,null,null,null,null,null,null,"","","","","","","","","","","","","","","","","","","","","","","","","","","","","","","","","","","","","","","","","","","","","",""]
[null,420,null,null,null,null,null,null,null,null,null,null,null,null,null,null,null,null,null,null,null,null,null,null,"","","","","","","","","","","","","","","","","","","","","","","","","","","","","","","","","","","","","","","","","","","","","",""]
[null,421,null,null,null,null,null,null,null,null,null,null,null,null,null,null,null,null,null,null,null,null,null,null,"","","","","","","","","","","","","","","","","","","","","","","","","","","","","","","","","","","","","","","","","","","","","",""]
[null,422,null,null,null,null,null,null,null,null,null,null,null,null,null,null,null,null,null,null,null,null,null,null,"","","","","","","","","","","","","","","","","","","","","","","","","","","","","","","","","","","","","","","","","","","","","",""]
[null,423,null,null,null,null,null,null,null,null,null,null,null,null,null,null,null,null,null,null,null,null,null,null,"","","","","","","","","","","","","","","","","","","","","","","","","","","","","","","","","","","","","","","","","","","","","",""]
[null,424,null,null,null,null,null,null,null,null,null,null,null,null,null,null,null,null,null,null,null,null,null,null,"","","","","","","","","","","","","","","","","","","","","","","","","","","","","","","","","","","","","","","","","","","","","",""]
[null,425,null,null,null,null,null,null,null,null,null,null,null,null,null,null,null,null,null,null,null,null,null,null,"","","","","","","","","","","","","","","","","","","","","","","","","","","","","","","","","","","","","","","","","","","","","",""]
[null,426,null,null,null,null,null,null,null,null,null,null,null,null,null,null,null,null,null,null,null,null,null,null,"","","","","","","","","","","","","","","","","","","","","","","","","","","","","","","","","","","","","","","","","","","","","",""]
[null,427,null,null,null,null,null,null,null,null,null,null,null,null,null,null,null,null,null,null,null,null,null,null,"","","","","","","","","","","","","","","","","","","","","","","","","","","","","","","","","","","","","","","","","","","","","",""]
[null,428,null,null,null,null,null,null,null,null,null,null,null,null,null,null,null,null,null,null,null,null,null,null,"","","","","","","","","","","","","","","","","","","","","","","","","","","","","","","","","","","","","","","","","","","","","",""]
[null,429,null,null,null,null,null,null,null,null,null,null,null,null,null,null,null,null,null,null,null,null,null,null,"","","","","","","","","","","","","","","","","","","","","","","","","","","","","","","","","","","","","","","","","","","","","",""]
[null,430,null,null,null,null,null,null,null,null,null,null,null,null,null,null,null,null,null,null,null,null,null,null,"","","","","","","","","","","","","","","","","","","","","","","","","","","","","","","","","","","","","","","","","","","","","",""]
[null,431,null,null,null,null,null,null,null,null,null,null,null,null,null,null,null,null,null,null,null,null,null,null,"","","","","","","","","","","","","","","","","","","","","","","","","","","","","","","","","","","","","","","","","","","","","",""]
[null,432,null,null,null,null,null,null,null,null,null,null,null,null,null,null,null,null,null,null,null,null,null,null,"","","","","","","","","","","","","","","","","","","","","","","","","","","","","","","","","","","","","","","","","","","","","",""]
[null,433,null,null,null,null,null,null,null,null,null,null,null,null,null,null,null,null,null,null,null,null,null,null,"","","","","","","","","","","","","","","","","","","","","","","","","","","","","","","","","","","","","","","","","","","","","",""]
[null,434,null,null,null,null,null,null,null,null,null,null,null,null,null,null,null,null,null,null,null,null,null,null,"","","","","","","","","","","","","","","","","","","","","","","","","","","","","","","","","","","","","","","","","","","","","",""]
[null,435,null,null,null,null,null,null,null,null,null,null,null,null,null,null,null,null,null,null,null,null,null,null,"","","","","","","","","","","","","","","","","","","","","","","","","","","","","","","","","","","","","","","","","","","","","",""]
[null,436,null,null,null,null,null,null,null,null,null,null,null,null,null,null,null,null,null,null,null,null,null,null,"","","","","","","","","","","","","","","","","","","","","","","","","","","","","","","","","","","","","","","","","","","","","",""]
[null,437,null,null,null,null,null,null,null,null,null,null,null,null,null,null,null,null,null,null,null,null,null,null,"","","","","","","","","","","","","","","","","","","","","","","","","","","","","","","","","","","","","","","","","","","","","",""]
[null,438,null,null,null,null,null,null,null,null,null,null,null,null,null,null,null,null,null,null,null,null,null,null,"","","","","","","","","","","","","","","","","","","","","","","","","","","","","","","","","","","","","","","","","","","","","",""]
[null,439,null,null,null,null,null,null,null,null,null,null,null,null,null,null,null,null,null,null,null,null,null,null,"","","","","","","","","","","","","","","","","","","","","","","","","","","","","","","","","","","","","","","","","","","","","",""]
[null,440,null,null,null,null,null,null,null,null,null,null,null,null,null,null,null,null,null,null,null,null,null,null,"","","","","","","","","","","","","","","","","","","","","","","","","","","","","","","","","","","","","","","","","","","","","",""]
[null,441,null,null,null,null,null,null,null,null,null,null,null,null,null,null,null,null,null,null,null,null,null,null,"","","","","","","","","","","","","","","","","","","","","","","","","","","","","","","","","","","","","","","","","","","","","",""]
[null,442,null,null,null,null,null,null,null,null,null,null,null,null,null,null,null,null,null,null,null,null,null,null,"","","","","","","","","","","","","","","","","","","","","","","","","","","","","","","","","","","","","","","","","","","","","",""]
[null,443,null,null,null,null,null,null,null,null,null,null,null,null,null,null,null,null,null,null,null,null,null,null,"","","","","","","","","","","","","","","","","","","","","","","","","","","","","","","","","","","","","","","","","","","","","",""]
[null,444,null,null,null,null,null,null,null,null,null,null,null,null,null,null,null,null,null,null,null,null,null,null,"","","","","","","","","","","","","","","","","","","","","","","","","","","","","","","","","","","","","","","","","","","","","",""]
[null,445,null,null,null,null,null,null,null,null,null,null,null,null,null,null,null,null,null,null,null,null,null,null,"","","","","","","","","","","","","","","","","","","","","","","","","","","","","","","","","","","","","","","","","","","","","",""]
[null,446,null,null,null,null,null,null,null,null,null,null,null,null,null,null,null,null,null,null,null,null,null,null,"","","","","","","","","","","","","","","","","","","","","","","","","","","","","","","","","","","","","","","","","","","","","",""]
[null,447,null,null,null,null,null,null,null,null,null,null,null,null,null,null,null,null,null,null,null,null,null,null,"","","","","","","","","","","","","","","","","","","","","","","","","","","","","","","","","","","","","","","","","","","","","",""]
[null,448,null,null,null,null,null,null,null,null,null,null,null,null,null,null,null,null,null,null,null,null,null,null,"","","","","","","","","","","","","","","","","","","","","","","","","","","","","","","","","","","","","","","","","","","","","",""]
[null,449,null,null,null,null,null,null,null,null,null,null,null,null,null,null,null,null,null,null,null,null,null,null,"",{"$f":"IF(F456=\"\",\"\",CONCATENATE($V$7,\".\",F456))","v":""},{"$f":"IF(H456=\"\",\"\",IF(H456=\"BYTE\",\"Integer\",IF(H456=\"WORD\",\"UINT\",IF(H456=\"DWORD\",\"UDINT\",H456))))","v":""},"","",{"$f":"IF(F456=\"\",\"\",CONCATENATE(R456))","v":""},"","","","","","","","","","","","","","","","","","","","",{"$f":"IF(AA457=\"\",\"\",CONCATENATE(\"%MW\",E456))","v":""},"","","","","","","","","","","","","","","","","","",""]
[null,450,null,null,null,null,null,null,null,null,null,null,null,null,null,null,null,null,null,null,null,null,null,null,{"$f":"IF(IFERROR(Z458,\"\")=\"\",\"\",\"Variable\")","v":""},"","",{"$f":"IF(AA458=\"\",\"\",$V$8)","v":""},{"$f":"IF(AA458=\"\",\"\",$V$13)","v":""},"",{"$f":"IF(AA458=\"\",\"\",J457)","v":""},{"$f":"IF(AA458=\"\",\"\",IF(AA458=\"BOOL\",\"\", IF(AA458=\"INT\",\"\",IF(AA458=\"DINT\",\"\",IF(AA458=\"UINT\",\"\",IF(AA458=\"REAL\",\"\",IF(AA458=\"Integer\",\"\",IF(AA458=\"UDINT\",\"\",\"\")))))) ))","v":""},{"$f":"IF(AA458=\"\",\"\",$V$9)","v":""},{"$f":"IF(AA458=\"\",\"\",$V$10)","v":""},{"$f":"IF(AA458=\"\",\"\",$V$11)","v":""},{"$f":"IF(AA458=\"\",\"\",IF(AA458=\"BOOL\",\"\", IF(AA458=\"INT\",\"\",IF(AA458=\"DINT\",\"\",IF(AA458=\"UINT\",\"\",IF(AA458=\"REAL\",\"\",IF(AA458=\"Integer\",\"\",IF(AA458=\"UDINT\",\"\",\"\")))))) ))","v":""},{"$f":"IF(AA458=\"\",\"\",IF(AA458=\"BOOL\",\"\", IF(AA458=\"INT\",\"\",IF(AA458=\"DINT\",\"\",IF(AA458=\"UINT\",\"\",IF(AA458=\"REAL\",\"\",IF(AA458=\"Integer\",\"\",IF(AA458=\"UDINT\",\"\",\"\")))))) ))","v":""},{"$f":"IF(AA458=\"\",\"\",IF(AA458=\"BOOL\",\"\", IF(AA458=\"INT\",\"\",IF(AA458=\"DINT\",\"\",IF(AA458=\"UINT\",\"\",IF(AA458=\"REAL\",\"\",IF(AA458=\"Integer\",\"\",IF(AA458=\"UDINT\",\"\",\"\")))))) ))","v":""},{"$f":"IF(AA458=\"\",\"\",IF(AA458=\"BOOL\",\"\", IF(AA458=\"INT\",\"\",IF(AA458=\"DINT\",\"\",IF(AA458=\"UINT\",\"\",IF(AA458=\"REAL\",\"\",IF(AA458=\"Integer\",\"\",IF(AA458=\"UDINT\",\"\",\"\")))))) ))","v":""},{"$f":"IF(AA458=\"\",\"\",IF(AA458=\"BOOL\",\"\", IF(AA458=\"INT\",\"\",IF(AA458=\"DINT\",\"\",IF(AA458=\"UINT\",\"\",IF(AA458=\"REAL\",\"\",IF(AA458=\"Integer\",\"\",IF(AA458=\"UDINT\",\"\",\"\")))))) ))","v":""},{"$f":"IF(AA458=\"\",\"\",IF(AA458=\"BOOL\",\"\", IF(AA458=\"INT\",\"\",IF(AA458=\"DINT\",\"\",IF(AA458=\"UINT\",\"\",IF(AA458=\"REAL\",\"\",IF(AA458=\"Integer\",\"\",IF(AA458=\"UDINT\",\"\",\"\")))))) ))","v":""},{"$f":"IF(AA458=\"\",\"\",IF(AA458=\"BOOL\",\"\", IF(AA458=\"INT\",\"\",IF(AA458=\"DINT\",\"\",IF(AA458=\"UINT\",\"\",IF(AA458=\"REAL\",\"\",IF(AA458=\"Integer\",\"\",IF(AA458=\"UDINT\",\"\",\"\")))))) ))","v":""},{"$f":"IF(AA458=\"\",\"\",IF(AA458=\"BOOL\",\"\", IF(AA458=\"INT\",\"\",IF(AA458=\"DINT\",\"\",IF(AA458=\"UINT\",\"\",IF(AA458=\"REAL\",\"\",IF(AA458=\"Integer\",\"\",IF(AA458=\"UDINT\",\"\",\"\")))))) ))","v":""},{"$f":"IF(AA458=\"\",\"\",IF(AA458=\"BOOL\",\"\", IF(AA458=\"INT\",\"\",IF(AA458=\"DINT\",\"\",IF(AA458=\"UINT\",\"\",IF(AA458=\"REAL\",\"\",IF(AA458=\"Integer\",\"\",IF(AA458=\"UDINT\",\"\",\"\")))))) ))","v":""},{"$f":"IF(AA458=\"\",\"\",IF(AA458=\"BOOL\",\"\", IF(AA458=\"INT\",\"\",IF(AA458=\"DINT\",\"\",IF(AA458=\"UINT\",\"\",IF(AA458=\"REAL\",\"\",IF(AA458=\"Integer\",\"\",IF(AA458=\"UDINT\",\"\",\"\")))))) ))","v":""},{"$f":"IF(AA458=\"\",\"\",IF(AA458=\"BOOL\",\"\", IF(AA458=\"INT\",\"\",IF(AA458=\"DINT\",\"\",IF(AA458=\"UINT\",\"\",IF(AA458=\"REAL\",\"\",IF(AA458=\"Integer\",\"\",IF(AA458=\"UDINT\",\"\",\"\")))))) ))","v":""},{"$f":"IF(AA458=\"\",\"\",IF(AA458=\"BOOL\",\"\", IF(AA458=\"INT\",\"\",IF(AA458=\"DINT\",\"\",IF(AA458=\"UINT\",\"\",IF(AA458=\"REAL\",\"\",IF(AA458=\"Integer\",\"\",IF(AA458=\"UDINT\",\"\",\"\")))))) ))","v":""},{"$f":"IF(AA458=\"\",\"\",IF(AA458=\"BOOL\",\"\", IF(AA458=\"INT\",\"\",IF(AA458=\"DINT\",\"\",IF(AA458=\"UINT\",\"\",IF(AA458=\"REAL\",\"\",IF(AA458=\"Integer\",\"\",IF(AA458=\"UDINT\",\"\",\"\")))))) ))","v":""},{"$f":"IF(AA458=\"\",\"\",IF(AA458=\"BOOL\",\"\", IF(AA458=\"INT\",\"\",IF(AA458=\"DINT\",\"\",IF(AA458=\"UINT\",\"\",IF(AA458=\"REAL\",\"\",IF(AA458=\"Integer\",\"\",IF(AA458=\"UDINT\",\"\",\"\")))))) ))","v":""},{"$f":"IF(AA458=\"\",\"\",$V$12)","v":""},"",{"$f":"IF(AA458=\"\",\"\",IF( AA458=\"BOOL\",CONCATENATE(\"X\",\"0\"),\"\"))","v":""},{"$f":"IF(AA458=\"\",\"\",IF(AA458=\"BOOL\",\"\", IF(AA458=\"INT\",\"BIN\",IF(AA458=\"DINT\",\"BIN\",IF(AA458=\"UINT\",\"BIN\",IF(AA458=\"REAL\",\"\",IF(AA458=\"Integer\",\"BIN\",IF(AA458=\"UDINT\",\"BIN\",\"\")))))) ))","v":""},{"$f":"IF(AA458=\"\",\"\",IF(AA458=\"BOOL\",\"\", IF(AA458=\"INT\",\"2sComplement\",IF(AA458=\"DINT\",\"2sComplement\",IF(AA458=\"UINT\",\"Unsigned\",IF(AA458=\"REAL\",\"\",IF(AA458=\"Integer\",\"Unsigned\",IF(AA458=\"UDINT\",\"Unsigned\",\"\")))))) ))","v":""},{"$f":"IF(AA458=\"\",\"\",IF(AA458=\"BOOL\",\"\", IF(AA458=\"INT\",\"16Bits\",IF(AA458=\"DINT\",\"32Bits\",IF(AA458=\"UINT\",\"16Bits\",IF(AA458=\"REAL\",\"\",IF(AA458=\"Integer\",\"BitField\",IF(AA458=\"UDINT\",\"32Bits\",\"\")))))) ))","v":""},{"$f":"IF(AA458=\"\",\"\",IF(AA458=\"BOOL\",\"\", IF(AA458=\"INT\",\"\",IF(AA458=\"DINT\",\"\",IF(AA458=\"UINT\",\"\",IF(AA458=\"REAL\",\"\",IF(AA458=\"Integer\",\"0\",IF(AA458=\"UDINT\",\"\",\"\")))))) ))","v":""},{"$f":"IF(AA458=\"\",\"\",IF(AA458=\"BOOL\",\"\", IF(AA458=\"INT\",\"\",IF(AA458=\"DINT\",\"\",IF(AA458=\"UINT\",\"\",IF(AA458=\"REAL\",\"\",IF(AA458=\"Integer\",\"8\",IF(AA458=\"UDINT\",\"\",\"\")))))) ))","v":""},{"$f":"IF(AA458=\"\",\"\",IF(AA458=\"BOOL\",\"\", IF(AA458=\"INT\",\"Disable\",IF(AA458=\"DINT\",\"Disable\",IF(AA458=\"UINT\",\"Disable\",IF(AA458=\"REAL\",\"Disable\",IF(AA458=\"Integer\",\"Disable\",IF(AA458=\"UDINT\",\"Disable\",\"\")))))) ))","v":""},{"$f":"IF(AA458=\"\",\"\",IF(AA458=\"BOOL\",\"\", IF(AA458=\"INT\",\"\",IF(AA458=\"DINT\",\"\",IF(AA458=\"UINT\",\"\",IF(AA458=\"REAL\",\"\",IF(AA458=\"Integer\",\"\",IF(AA458=\"UDINT\",\"\",\"\")))))) ))","v":""},{"$f":"IF(AA458=\"\",\"\",IF(AA458=\"BOOL\",\"\", IF(AA458=\"INT\",\"\",IF(AA458=\"DINT\",\"\",IF(AA458=\"UINT\",\"\",IF(AA458=\"REAL\",\"\",IF(AA458=\"Integer\",\"\",IF(AA458=\"UDINT\",\"\",\"\")))))) ))","v":""},{"$f":"IF(AA458=\"\",\"\",IF(AA458=\"BOOL\",\"\", IF(AA458=\"INT\",\"Disable\",IF(AA458=\"DINT\",\"Disable\",IF(AA458=\"UINT\",\"Disable\",IF(AA458=\"REAL\",\"Disable\",IF(AA458=\"Integer\",\"Disable\",IF(AA458=\"UDINT\",\"Disable\",\"\")))))) ))","v":""},{"$f":"IF(AA458=\"\",\"\",IF(AA458=\"BOOL\",\"\", IF(AA458=\"INT\",\"\",IF(AA458=\"DINT\",\"\",IF(AA458=\"UINT\",\"\",IF(AA458=\"REAL\",\"\",IF(AA458=\"Integer\",\"\",IF(AA458=\"UDINT\",\"\",\"\")))))) ))","v":""},{"$f":"IF(AA458=\"\",\"\",IF(AA458=\"BOOL\",\"\", IF(AA458=\"INT\",\"\",IF(AA458=\"DINT\",\"\",IF(AA458=\"UINT\",\"\",IF(AA458=\"REAL\",\"\",IF(AA458=\"Integer\",\"\",IF(AA458=\"UDINT\",\"\",\"\")))))) ))","v":""},{"$f":"IF(AA458=\"\",\"\",IF(AA458=\"BOOL\",\"\", IF(AA458=\"INT\",\"\",IF(AA458=\"DINT\",\"\",IF(AA458=\"UINT\",\"\",IF(AA458=\"REAL\",\"\",IF(AA458=\"Integer\",\"\",IF(AA458=\"UDINT\",\"\",\"\")))))) ))","v":""},{"$f":"IF(AA458=\"\",\"\",IF(AA458=\"BOOL\",\"\", IF(AA458=\"INT\",\"\",IF(AA458=\"DINT\",\"\",IF(AA458=\"UINT\",\"\",IF(AA458=\"REAL\",\"\",IF(AA458=\"Integer\",\"\",IF(AA458=\"UDINT\",\"\",\"\")))))) ))","v":""},{"$f":"IF(AA458=\"\",\"\",IF(AA458=\"BOOL\",\"Disable\", IF(AA458=\"INT\",\"Disable\",IF(AA458=\"DINT\",\"Disable\",IF(AA458=\"UINT\",\"Disable\",IF(AA458=\"REAL\",\"Disable\",IF(AA458=\"Integer\",\"Disable\",IF(AA458=\"UDINT\",\"Disable\",\"\")))))) ))","v":""},{"$f":"IF(AA458=\"\",\"\",IF(AA458=\"BOOL\",\"\", IF(AA458=\"INT\",\"\",IF(AA458=\"DINT\",\"\",IF(AA458=\"UINT\",\"\",IF(AA458=\"REAL\",\"\",IF(AA458=\"Integer\",\"\",IF(AA458=\"UDINT\",\"\",\"\")))))) ))","v":""},{"$f":"IF(AA458=\"\",\"\",IF(AA458=\"BOOL\",\"\", IF(AA458=\"INT\",\"\",IF(AA458=\"DINT\",\"\",IF(AA458=\"UINT\",\"\",IF(AA458=\"REAL\",\"\",IF(AA458=\"Integer\",\"\",IF(AA458=\"UDINT\",\"\",\"\")))))) ))","v":""},{"$f":"IF(AA458=\"\",\"\",IF(AA458=\"BOOL\",\"None\", IF(AA458=\"INT\",\"None\",IF(AA458=\"DINT\",\"None\",IF(AA458=\"UINT\",\"None\",IF(AA458=\"REAL\",\"None\",IF(AA458=\"Integer\",\"None\",IF(AA458=\"UDINT\",\"None\",\"\")))))) ))","v":""},{"$f":"IF(AA458=\"\",\"\",IF(AA458=\"BOOL\",\"Disable\", IF(AA458=\"INT\",\"Disable\",IF(AA458=\"DINT\",\"Disable\",IF(AA458=\"UINT\",\"Disable\",IF(AA458=\"REAL\",\"Disable\",IF(AA458=\"Integer\",\"Disable\",IF(AA458=\"UDINT\",\"Disable\",\"\")))))) ))","v":""}]
[null,451,null,null,null,null,null,null,null,null,null,null,null,null,null,null,null,null,null,null,null,null,null,null,"","","","","","","","","","","","","","","","","","","","","","","","","","","","","","","","","","","","","","","","","","","","","",""]
[null,452,null,null,null,null,null,null,null,null,null,null,null,null,null,null,null,null,null,null,null,null,null,null,"","","","","","","","","","","","","","","","","","","","","","","","","","","","","","","","","","","","","","","","","","","","","",""]
[null,453,null,null,null,null,null,null,null,null,null,null,null,null,null,null,null,null,null,null,null,null,null,null,"","","","","","","","","","","","","","","","","","","","","","","","","","","","","","","","","","","","","","","","","","","","","",""]
[null,454,null,null,null,null,null,null,null,null,null,null,null,null,null,null,null,null,null,null,null,null,null,null,"","","","","","","","","","","","","","","","","","","","","","","","","","","","","","","","","","","","","","","","","","","","","",""]
[null,455,null,null,null,null,null,null,null,null,null,null,null,null,null,null,null,null,null,null,null,null,null,null,"","","","","","","","","","","","","","","","","","","","","","","","","","","","","","","","","","","","","","","","","","","","","",""]
[null,456,null,null,null,null,null,null,null,null,null,null,null,null,null,null,null,null,null,null,null,null,null,null,"","","","","","","","","","","","","","","","","","","","","","","","","","","","","","","","","","","","","","","","","","","","","",""]
[null,457,null,null,null,null,null,null,null,null,null,null,null,null,null,null,null,null,null,null,null,null,null,null,"","","","","","","","","","","","","","","","","","","","","","","","","","","","","","","","","","","","","","","","","","","","","",""]
[null,458,null,null,null,null,null,null,null,null,null,null,null,null,null,null,null,null,null,null,null,null,null,null,"","","","","","","","","","","","","","","","","","","","","","","","","","","","","","","","","","","","","","","","","","","","","",""]
[null,459,null,null,null,null,null,null,null,null,null,null,null,null,null,null,null,null,null,null,null,null,null,null,"","","","","","","","","","","","","","","","","","","","","","","","","","","","","","","","","","","","","","","","","","","","","",""]
[null,460,null,null,null,null,null,null,null,null,null,null,null,null,null,null,null,null,null,null,null,null,null,null,"","","","","","","","","","","","","","","","","","","","","","","","","","","","","","","","","","","","","","","","","","","","","",""]
[null,461,null,null,null,null,null,null,null,null,null,null,null,null,null,null,null,null,null,null,null,null,null,null,"","","","","","","","","","","","","","","","","","","","","","","","","","","","","","","","","","","","","","","","","","","","","",""]
[null,462,null,null,null,null,null,null,null,null,null,null,null,null,null,null,null,null,null,null,null,null,null,null,"","","","","","","","","","","","","","","","","","","","","","","","","","","","","","","","","","","","","","","","","","","","","",""]
[null,463,null,null,null,null,null,null,null,null,null,null,null,null,null,null,null,null,null,null,null,null,null,null,"","","","","","","","","","","","","","","","","","","","","","","","","","","","","","","","","","","","","","","","","","","","","",""]
[null,464,null,null,null,null,null,null,null,null,null,null,null,null,null,null,null,null,null,null,null,null,null,null,"","","","","","","","","","","","","","","","","","","","","","","","","","","","","","","","","","","","","","","","","","","","","",""]
[null,465,null,null,null,null,null,null,null,null,null,null,null,null,null,null,null,null,null,null,null,null,null,null,"","","","","","","","","","","","","","","","","","","","","","","","","","","","","","","","","","","","","","","","","","","","","",""]
[null,466,null,null,null,null,null,null,null,null,null,null,null,null,null,null,null,null,null,null,null,null,null,null,"","","","","","","","","","","","","","","","","","","","","","","","","","","","","","","","","","","","","","","","","","","","","",""]
[null,467,null,null,null,null,null,null,null,null,null,null,null,null,null,null,null,null,null,null,null,null,null,null,"","","","","","","","","","","","","","","","","","","","","","","","","","","","","","","","","","","","","","","","","","","","","",""]
[null,468,null,null,null,null,null,null,null,null,null,null,null,null,null,null,null,null,null,null,null,null,null,null,"","","","","","","","","","","","","","","","","","","","","","","","","","","","","","","","","","","","","","","","","","","","","",""]
[null,469,null,null,null,null,null,null,null,null,null,null,null,null,null,null,null,null,null,null,null,null,null,null,"","","","","","","","","","","","","","","","","","","","","","","","","","","","","","","","","","","","","","","","","","","","","",""]
[null,470,null,null,null,null,null,null,null,null,null,null,null,null,null,null,null,null,null,null,null,null,null,null,"","","","","","","","","","","","","","","","","","","","","","","","","","","","","","","","","","","","","","","","","","","","","",""]
[null,471,null,null,null,null,null,null,null,null,null,null,null,null,null,null,null,null,null,null,null,null,null,null,"","","","","","","","","","","","","","","","","","","","","","","","","","","","","","","","","","","","","","","","","","","","","",""]
[null,472,null,null,null,null,null,null,null,null,null,null,null,null,null,null,null,null,null,null,null,null,null,null,"","","","","","","","","","","","","","","","","","","","","","","","","","","","","","","","","","","","","","","","","","","","","",""]
[null,473,null,null,null,null,null,null,null,null,null,null,null,null,null,null,null,null,null,null,null,null,null,null,"","","","","","","","","","","","","","","","","","","","","","","","","","","","","","","","","","","","","","","","","","","","","",""]
[null,474,null,null,null,null,null,null,null,null,null,null,null,null,null,null,null,null,null,null,null,null,null,null,"","","","","","","","","","","","","","","","","","","","","","","","","","","","","","","","","","","","","","","","","","","","","",""]
[null,475,null,null,null,null,null,null,null,null,null,null,null,null,null,null,null,null,null,null,null,null,null,null,"","","","","","","","","","","","","","","","","","","","","","","","","","","","","","","","","","","","","","","","","","","","","",""]
[null,476,null,null,null,null,null,null,null,null,null,null,null,null,null,null,null,null,null,null,null,null,null,null,"","","","","","","","","","","","","","","","","","","","","","","","","","","","","","","","","","","","","","","","","","","","","",""]
[null,477,null,null,null,null,null,null,null,null,null,null,null,null,null,null,null,null,null,null,null,null,null,null,"","","","","","","","","","","","","","","","","","","","","","","","","","","","","","","","","","","","","","","","","","","","","",""]
[null,478,null,null,null,null,null,null,null,null,null,null,null,null,null,null,null,null,null,null,null,null,null,null,"","","","","","","","","","","","","","","","","","","","","","","","","","","","","","","","","","","","","","","","","","","","","",""]
[null,479,null,null,null,null,null,null,null,null,null,null,null,null,null,null,null,null,null,null,null,null,null,null,"","","","","","","","","","","","","","","","","","","","","","","","","","","","","","","","","","","","","","","","","","","","","",""]
[null,480,null,null,null,null,null,null,null,null,null,null,null,null,null,null,null,null,null,null,null,null,null,null,"","","","","","","","","","","","","","","","","","","","","","","","","","","","","","","","","","","","","","","","","","","","","",""]
[null,481,null,null,null,null,null,null,null,null,null,null,null,null,null,null,null,null,null,null,null,null,null,null,"","","","","","","","","","","","","","","","","","","","","","","","","","","","","","","","","","","","","","","","","","","","","",""]
[null,482,null,null,null,null,null,null,null,null,null,null,null,null,null,null,null,null,null,null,null,null,null,null,"","","","","","","","","","","","","","","","","","","","","","","","","","","","","","","","","","","","","","","","","","","","","",""]
[null,483,null,null,null,null,null,null,null,null,null,null,null,null,null,null,null,null,null,null,null,null,null,null,"","","","","","","","","","","","","","","","","","","","","","","","","","","","","","","","","","","","","","","","","","","","","",""]
[null,484,null,null,null,null,null,null,null,null,null,null,null,null,null,null,null,null,null,null,null,null,null,null,"","","","","","","","","","","","","","","","","","","","","","","","","","","","","","","","","","","","","","","","","","","","","",""]
[null,485,null,null,null,null,null,null,null,null,null,null,null,null,null,null,null,null,null,null,null,null,null,null,"","","","","","","","","","","","","","","","","","","","","","","","","","","","","","","","","","","","","","","","","","","","","",""]
[null,486,null,null,null,null,null,null,null,null,null,null,null,null,null,null,null,null,null,null,null,null,null,null,"","","","","","","","","","","","","","","","","","","","","","","","","","","","","","","","","","","","","","","","","","","","","",""]
[null,487,null,null,null,null,null,null,null,null,null,null,null,null,null,null,null,null,null,null,null,null,null,null,"","","","","","","","","","","","","","","","","","","","","","","","","","","","","","","","","","","","","","","","","","","","","",""]
[null,488,null,null,null,null,null,null,null,null,null,null,null,null,null,null,null,null,null,null,null,null,null,null,"","","","","","","","","","","","","","","","","","","","","","","","","","","","","","","","","","","","","","","","","","","","","",""]
[null,489,null,null,null,null,null,null,null,null,null,null,null,null,null,null,null,null,null,null,null,null,null,null,{"$f":"IF(IFERROR(Z497,\"\")=\"\",\"\",\"Variable\")","v":""},{"$f":"IF(F496=\"\",\"\",CONCATENATE($V$7,\".\",F496))","v":""},{"$f":"IF(H496=\"\",\"\",IF(H496=\"BYTE\",\"Integer\",IF(H496=\"WORD\",\"UINT\",IF(H496=\"DWORD\",\"UDINT\",H496))))","v":""},{"$f":"IF(AA497=\"\",\"\",$V$8)","v":""},{"$f":"IF(AA497=\"\",\"\",$V$13)","v":""},{"$f":"IF(F496=\"\",\"\",CONCATENATE(R496))","v":""},{"$f":"IF(AA497=\"\",\"\",J496)","v":""},{"$f":"IF(AA497=\"\",\"\",IF(AA497=\"BOOL\",\"\", IF(AA497=\"INT\",\"\",IF(AA497=\"DINT\",\"\",IF(AA497=\"UINT\",\"\",IF(AA497=\"REAL\",\"\",IF(AA497=\"Integer\",\"\",IF(AA497=\"UDINT\",\"\",\"\")))))) ))","v":""},{"$f":"IF(AA497=\"\",\"\",$V$9)","v":""},{"$f":"IF(AA497=\"\",\"\",$V$10)","v":""},{"$f":"IF(AA497=\"\",\"\",$V$11)","v":""},{"$f":"IF(AA497=\"\",\"\",IF(AA497=\"BOOL\",\"\", IF(AA497=\"INT\",\"\",IF(AA497=\"DINT\",\"\",IF(AA497=\"UINT\",\"\",IF(AA497=\"REAL\",\"\",IF(AA497=\"Integer\",\"\",IF(AA497=\"UDINT\",\"\",\"\")))))) ))","v":""},{"$f":"IF(AA497=\"\",\"\",IF(AA497=\"BOOL\",\"\", IF(AA497=\"INT\",\"\",IF(AA497=\"DINT\",\"\",IF(AA497=\"UINT\",\"\",IF(AA497=\"REAL\",\"\",IF(AA497=\"Integer\",\"\",IF(AA497=\"UDINT\",\"\",\"\")))))) ))","v":""},{"$f":"IF(AA497=\"\",\"\",IF(AA497=\"BOOL\",\"\", IF(AA497=\"INT\",\"\",IF(AA497=\"DINT\",\"\",IF(AA497=\"UINT\",\"\",IF(AA497=\"REAL\",\"\",IF(AA497=\"Integer\",\"\",IF(AA497=\"UDINT\",\"\",\"\")))))) ))","v":""},{"$f":"IF(AA497=\"\",\"\",IF(AA497=\"BOOL\",\"\", IF(AA497=\"INT\",\"\",IF(AA497=\"DINT\",\"\",IF(AA497=\"UINT\",\"\",IF(AA497=\"REAL\",\"\",IF(AA497=\"Integer\",\"\",IF(AA497=\"UDINT\",\"\",\"\")))))) ))","v":""},{"$f":"IF(AA497=\"\",\"\",IF(AA497=\"BOOL\",\"\", IF(AA497=\"INT\",\"\",IF(AA497=\"DINT\",\"\",IF(AA497=\"UINT\",\"\",IF(AA497=\"REAL\",\"\",IF(AA497=\"Integer\",\"\",IF(AA497=\"UDINT\",\"\",\"\")))))) ))","v":""},{"$f":"IF(AA497=\"\",\"\",IF(AA497=\"BOOL\",\"\", IF(AA497=\"INT\",\"\",IF(AA497=\"DINT\",\"\",IF(AA497=\"UINT\",\"\",IF(AA497=\"REAL\",\"\",IF(AA497=\"Integer\",\"\",IF(AA497=\"UDINT\",\"\",\"\")))))) ))","v":""},{"$f":"IF(AA497=\"\",\"\",IF(AA497=\"BOOL\",\"\", IF(AA497=\"INT\",\"\",IF(AA497=\"DINT\",\"\",IF(AA497=\"UINT\",\"\",IF(AA497=\"REAL\",\"\",IF(AA497=\"Integer\",\"\",IF(AA497=\"UDINT\",\"\",\"\")))))) ))","v":""},{"$f":"IF(AA497=\"\",\"\",IF(AA497=\"BOOL\",\"\", IF(AA497=\"INT\",\"\",IF(AA497=\"DINT\",\"\",IF(AA497=\"UINT\",\"\",IF(AA497=\"REAL\",\"\",IF(AA497=\"Integer\",\"\",IF(AA497=\"UDINT\",\"\",\"\")))))) ))","v":""},{"$f":"IF(AA497=\"\",\"\",IF(AA497=\"BOOL\",\"\", IF(AA497=\"INT\",\"\",IF(AA497=\"DINT\",\"\",IF(AA497=\"UINT\",\"\",IF(AA497=\"REAL\",\"\",IF(AA497=\"Integer\",\"\",IF(AA497=\"UDINT\",\"\",\"\")))))) ))","v":""},{"$f":"IF(AA497=\"\",\"\",IF(AA497=\"BOOL\",\"\", IF(AA497=\"INT\",\"\",IF(AA497=\"DINT\",\"\",IF(AA497=\"UINT\",\"\",IF(AA497=\"REAL\",\"\",IF(AA497=\"Integer\",\"\",IF(AA497=\"UDINT\",\"\",\"\")))))) ))","v":""},{"$f":"IF(AA497=\"\",\"\",IF(AA497=\"BOOL\",\"\", IF(AA497=\"INT\",\"\",IF(AA497=\"DINT\",\"\",IF(AA497=\"UINT\",\"\",IF(AA497=\"REAL\",\"\",IF(AA497=\"Integer\",\"\",IF(AA497=\"UDINT\",\"\",\"\")))))) ))","v":""},{"$f":"IF(AA497=\"\",\"\",IF(AA497=\"BOOL\",\"\", IF(AA497=\"INT\",\"\",IF(AA497=\"DINT\",\"\",IF(AA497=\"UINT\",\"\",IF(AA497=\"REAL\",\"\",IF(AA497=\"Integer\",\"\",IF(AA497=\"UDINT\",\"\",\"\")))))) ))","v":""},{"$f":"IF(AA497=\"\",\"\",IF(AA497=\"BOOL\",\"\", IF(AA497=\"INT\",\"\",IF(AA497=\"DINT\",\"\",IF(AA497=\"UINT\",\"\",IF(AA497=\"REAL\",\"\",IF(AA497=\"Integer\",\"\",IF(AA497=\"UDINT\",\"\",\"\")))))) ))","v":""},{"$f":"IF(AA497=\"\",\"\",IF(AA497=\"BOOL\",\"\", IF(AA497=\"INT\",\"\",IF(AA497=\"DINT\",\"\",IF(AA497=\"UINT\",\"\",IF(AA497=\"REAL\",\"\",IF(AA497=\"Integer\",\"\",IF(AA497=\"UDINT\",\"\",\"\")))))) ))","v":""},{"$f":"IF(AA497=\"\",\"\",$V$12)","v":""},{"$f":"IF(AA497=\"\",\"\",CONCATENATE(\"%MW\",E496))","v":""},{"$f":"IF(AA497=\"\",\"\",IF( AA497=\"BOOL\",CONCATENATE(\"X\",\"0\"),\"\"))","v":""},{"$f":"IF(AA497=\"\",\"\",IF(AA497=\"BOOL\",\"\", IF(AA497=\"INT\",\"BIN\",IF(AA497=\"DINT\",\"BIN\",IF(AA497=\"UINT\",\"BIN\",IF(AA497=\"REAL\",\"\",IF(AA497=\"Integer\",\"BIN\",IF(AA497=\"UDINT\",\"BIN\",\"\")))))) ))","v":""},{"$f":"IF(AA497=\"\",\"\",IF(AA497=\"BOOL\",\"\", IF(AA497=\"INT\",\"2sComplement\",IF(AA497=\"DINT\",\"2sComplement\",IF(AA497=\"UINT\",\"Unsigned\",IF(AA497=\"REAL\",\"\",IF(AA497=\"Integer\",\"Unsigned\",IF(AA497=\"UDINT\",\"Unsigned\",\"\")))))) ))","v":""},{"$f":"IF(AA497=\"\",\"\",IF(AA497=\"BOOL\",\"\", IF(AA497=\"INT\",\"16Bits\",IF(AA497=\"DINT\",\"32Bits\",IF(AA497=\"UINT\",\"16Bits\",IF(AA497=\"REAL\",\"\",IF(AA497=\"Integer\",\"BitField\",IF(AA497=\"UDINT\",\"32Bits\",\"\")))))) ))","v":""},{"$f":"IF(AA497=\"\",\"\",IF(AA497=\"BOOL\",\"\", IF(AA497=\"INT\",\"\",IF(AA497=\"DINT\",\"\",IF(AA497=\"UINT\",\"\",IF(AA497=\"REAL\",\"\",IF(AA497=\"Integer\",\"0\",IF(AA497=\"UDINT\",\"\",\"\")))))) ))","v":""},{"$f":"IF(AA497=\"\",\"\",IF(AA497=\"BOOL\",\"\", IF(AA497=\"INT\",\"\",IF(AA497=\"DINT\",\"\",IF(AA497=\"UINT\",\"\",IF(AA497=\"REAL\",\"\",IF(AA497=\"Integer\",\"8\",IF(AA497=\"UDINT\",\"\",\"\")))))) ))","v":""},{"$f":"IF(AA497=\"\",\"\",IF(AA497=\"BOOL\",\"\", IF(AA497=\"INT\",\"Disable\",IF(AA497=\"DINT\",\"Disable\",IF(AA497=\"UINT\",\"Disable\",IF(AA497=\"REAL\",\"Disable\",IF(AA497=\"Integer\",\"Disable\",IF(AA497=\"UDINT\",\"Disable\",\"\")))))) ))","v":""},{"$f":"IF(AA497=\"\",\"\",IF(AA497=\"BOOL\",\"\", IF(AA497=\"INT\",\"\",IF(AA497=\"DINT\",\"\",IF(AA497=\"UINT\",\"\",IF(AA497=\"REAL\",\"\",IF(AA497=\"Integer\",\"\",IF(AA497=\"UDINT\",\"\",\"\")))))) ))","v":""},{"$f":"IF(AA497=\"\",\"\",IF(AA497=\"BOOL\",\"\", IF(AA497=\"INT\",\"\",IF(AA497=\"DINT\",\"\",IF(AA497=\"UINT\",\"\",IF(AA497=\"REAL\",\"\",IF(AA497=\"Integer\",\"\",IF(AA497=\"UDINT\",\"\",\"\")))))) ))","v":""},{"$f":"IF(AA497=\"\",\"\",IF(AA497=\"BOOL\",\"\", IF(AA497=\"INT\",\"Disable\",IF(AA497=\"DINT\",\"Disable\",IF(AA497=\"UINT\",\"Disable\",IF(AA497=\"REAL\",\"Disable\",IF(AA497=\"Integer\",\"Disable\",IF(AA497=\"UDINT\",\"Disable\",\"\")))))) ))","v":""},{"$f":"IF(AA497=\"\",\"\",IF(AA497=\"BOOL\",\"\", IF(AA497=\"INT\",\"\",IF(AA497=\"DINT\",\"\",IF(AA497=\"UINT\",\"\",IF(AA497=\"REAL\",\"\",IF(AA497=\"Integer\",\"\",IF(AA497=\"UDINT\",\"\",\"\")))))) ))","v":""},{"$f":"IF(AA497=\"\",\"\",IF(AA497=\"BOOL\",\"\", IF(AA497=\"INT\",\"\",IF(AA497=\"DINT\",\"\",IF(AA497=\"UINT\",\"\",IF(AA497=\"REAL\",\"\",IF(AA497=\"Integer\",\"\",IF(AA497=\"UDINT\",\"\",\"\")))))) ))","v":""},{"$f":"IF(AA497=\"\",\"\",IF(AA497=\"BOOL\",\"\", IF(AA497=\"INT\",\"\",IF(AA497=\"DINT\",\"\",IF(AA497=\"UINT\",\"\",IF(AA497=\"REAL\",\"\",IF(AA497=\"Integer\",\"\",IF(AA497=\"UDINT\",\"\",\"\")))))) ))","v":""},{"$f":"IF(AA497=\"\",\"\",IF(AA497=\"BOOL\",\"\", IF(AA497=\"INT\",\"\",IF(AA497=\"DINT\",\"\",IF(AA497=\"UINT\",\"\",IF(AA497=\"REAL\",\"\",IF(AA497=\"Integer\",\"\",IF(AA497=\"UDINT\",\"\",\"\")))))) ))","v":""},{"$f":"IF(AA497=\"\",\"\",IF(AA497=\"BOOL\",\"Disable\", IF(AA497=\"INT\",\"Disable\",IF(AA497=\"DINT\",\"Disable\",IF(AA497=\"UINT\",\"Disable\",IF(AA497=\"REAL\",\"Disable\",IF(AA497=\"Integer\",\"Disable\",IF(AA497=\"UDINT\",\"Disable\",\"\")))))) ))","v":""},{"$f":"IF(AA497=\"\",\"\",IF(AA497=\"BOOL\",\"\", IF(AA497=\"INT\",\"\",IF(AA497=\"DINT\",\"\",IF(AA497=\"UINT\",\"\",IF(AA497=\"REAL\",\"\",IF(AA497=\"Integer\",\"\",IF(AA497=\"UDINT\",\"\",\"\")))))) ))","v":""},{"$f":"IF(AA497=\"\",\"\",IF(AA497=\"BOOL\",\"\", IF(AA497=\"INT\",\"\",IF(AA497=\"DINT\",\"\",IF(AA497=\"UINT\",\"\",IF(AA497=\"REAL\",\"\",IF(AA497=\"Integer\",\"\",IF(AA497=\"UDINT\",\"\",\"\")))))) ))","v":""},{"$f":"IF(AA497=\"\",\"\",IF(AA497=\"BOOL\",\"None\", IF(AA497=\"INT\",\"None\",IF(AA497=\"DINT\",\"None\",IF(AA497=\"UINT\",\"None\",IF(AA497=\"REAL\",\"None\",IF(AA497=\"Integer\",\"None\",IF(AA497=\"UDINT\",\"None\",\"\")))))) ))","v":""},{"$f":"IF(AA497=\"\",\"\",IF(AA497=\"BOOL\",\"Disable\", IF(AA497=\"INT\",\"Disable\",IF(AA497=\"DINT\",\"Disable\",IF(AA497=\"UINT\",\"Disable\",IF(AA497=\"REAL\",\"Disable\",IF(AA497=\"Integer\",\"Disable\",IF(AA497=\"UDINT\",\"Disable\",\"\")))))) ))","v":""}]
[null,490,null,null,null,null,null,null,null,null,null,null,null,null,null,null,null,null,null,null,null,null,null,null,"","","","","","","","","","","","","","","","","","","","","","","","","","","","","","","","","","","","","","","","","","","","","",""]
[null,491,null,null,null,null,null,null,null,null,null,null,null,null,null,null,null,null,null,null,null,null,null,null,"","","","","","","","","","","","","","","","","","","","","","","","","","","","","","","","","","","","","","","","","","","","","",""]
[null,492,null,null,null,null,null,null,null,null,null,null,null,null,null,null,null,null,null,null,null,null,null,null,"","","","","","","","","","","","","","","","","","","","","","","","","","","","","","","","","","","","","","","","","","","","","",""]
[null,493,null,null,null,null,null,null,null,null,null,null,null,null,null,null,null,null,null,null,null,null,null,null,"","","","","","","","","","","","","","","","","","","","","","","","","","","","","","","","","","","","","","","","","","","","","",""]
[null,494,null,null,null,null,null,null,null,null,null,null,null,null,null,null,null,null,null,null,null,null,null,null,"","","","","","","","","","","","","","","","","","","","","","","","","","","","","","","","","","","","","","","","","","","","","",""]
[null,495,null,null,null,null,null,null,null,null,null,null,null,null,null,null,null,null,null,null,null,null,null,null,"","","","","","","","","","","","","","","","","","","","","","","","","","","","","","","","","","","","","","","","","","","","","",""]
[null,496,null,null,null,null,null,null,null,null,null,null,null,null,null,null,null,null,null,null,null,null,null,null,"","","","","","","","","","","","","","","","","","","","","","","","","","","","","","","","","","","","","","","","","","","","","",""]
[null,497,null,null,null,null,null,null,null,null,null,null,null,null,null,null,null,null,null,null,null,null,null,null,"","","","","","","","","","","","","","","","","","","","","","","","","","","","","","","","","","","","","","","","","","","","","",""]
[null,498,null,null,null,null,null,null,null,null,null,null,null,null,null,null,null,null,null,null,null,null,null,null,"","","","","","","","","","","","","","","","","","","","","","","","","","","","","","","","","","","","","","","","","","","","","",""]
[null,499,null,null,null,null,null,null,null,null,null,null,null,null,null,null,null,null,null,null,null,null,null,null,"","","","","","","","","","","","","","","","","","","","","","","","","","","","","","","","","","","","","","","","","","","","","",""]

{"sheet":"M172P_EEPROM","index":1,"n_rows":510,"n_cols":20,"rows_kept":510,"cut":false,"hidden":false,"merged":[]}
[]
[]
[]
[]
[]
[]
[]
[]
[]
[null,null,"INDEX",null,"#","Address","Name","Device Type","Application Type","Size","Default Value","Min","Max","Scale","Offset","Unit","Format","Access Level","Description","Note"]
[null,null,0,null,0,16384,"xVariable",5,"BOOL",null,0,null,null,1,0,null,null,3]
[null,null,1,null,1,16385,"iVariable",0,"INT",null,0,null,null,1,0,null,null,3]
[null,null,2,null,2,16386,"diVariable",1,"DINT",null,0,null,null,1,0,null,null,3]
[null,null,3,null,3,16388,"wVariable",2,"WORD",null,0,null,null,1,0,null,null,3]
[null,null,4,null,4,16389,"dwVariable",3,"DWORD",null,0,null,null,1,0,null,null,3]
[null,null,5,null,5,16391,"rVariable",4,"REAL",null,0,null,null,1,0,null,null,3]
[null,null,6,null,6,16393,"uiVariable",2,"UINT",null,0,null,null,1,0,null,null,3]
[null,null,7,null,7,16394,"udiVariable",3,"UDINT",null,0,null,null,1,0,null,null,3]
[null,null,8]
[null,null,9]
[null,null,10]
[null,null,11]
[null,null,12]
[null,null,13]
[null,null,14]
[null,null,15]
[null,null,16]
[null,null,17]
[null,null,18]
[null,null,19]
[null,null,20]
[null,null,21]
[null,null,22]
[null,null,23]
[null,null,24]
[null,null,25]
[null,null,26]
[null,null,27]
[null,null,28]
[null,null,29]
[null,null,30]
[null,null,31]
[null,null,32]
[null,null,33]
[null,null,34]
[null,null,35]
[null,null,36]
[null,null,37]
[null,null,38]
[null,null,39]
[null,null,40]
[null,null,41]
[null,null,42]
[null,null,43]
[null,null,44]
[null,null,45]
[null,null,46]
[null,null,47]
[null,null,48]
[null,null,49]
[null,null,50]
[null,null,51]
[null,null,52]
[null,null,53]
[null,null,54]
[null,null,55]
[null,null,56]
[null,null,57]
[null,null,58]
[null,null,59]
[null,null,60]
[null,null,61]
[null,null,62]
[null,null,63]
[null,null,64]
[null,null,65]
[null,null,66]
[null,null,67]
[null,null,68]
[null,null,69]
[null,null,70]
[null,null,71]
[null,null,72]
[null,null,73]
[null,null,74]
[null,null,75]
[null,null,76]
[null,null,77]
[null,null,78]
[null,null,79]
[null,null,80]
[null,null,81]
[null,null,82]
[null,null,83]
[null,null,84]
[null,null,85]
[null,null,86]
[null,null,87]
[null,null,88]
[null,null,89]
[null,null,90]
[null,null,91]
[null,null,92]
[null,null,93]
[null,null,94]
[null,null,95]
[null,null,96]
[null,null,97]
[null,null,98]
[null,null,99]
[null,null,100]
[null,null,101]
[null,null,102]
[null,null,103]
[null,null,104]
[null,null,105]
[null,null,106]
[null,null,107]
[null,null,108]
[null,null,109]
[null,null,110]
[null,null,111]
[null,null,112]
[null,null,113]
[null,null,114]
[null,null,115]
[null,null,116]
[null,null,117]
[null,null,118]
[null,null,119]
[null,null,120]
[null,null,121]
[null,null,122]
[null,null,123]
[null,null,124]
[null,null,125]
[null,null,126]
[null,null,127]
[null,null,128]
[null,null,129]
[null,null,130]
[null,null,131]
[null,null,132]
[null,null,133]
[null,null,134]
[null,null,135]
[null,null,136]
[null,null,137]
[null,null,138]
[null,null,139]
[null,null,140]
[null,null,141]
[null,null,142]
[null,null,143]
[null,null,144]
[null,null,145]
[null,null,146]
[null,null,147]
[null,null,148]
[null,null,149]
[null,null,150]
[null,null,151]
[null,null,152]
[null,null,153]
[null,null,154]
[null,null,155]
[null,null,156]
[null,null,157]
[null,null,158]
[null,null,159]
[null,null,160]
[null,null,161]
[null,null,162]
[null,null,163]
[null,null,164]
[null,null,165]
[null,null,166]
[null,null,167]
[null,null,168]
[null,null,169]
[null,null,170]
[null,null,171]
[null,null,172]
[null,null,173]
[null,null,174]
[null,null,175]
[null,null,176]
[null,null,177]
[null,null,178]
[null,null,179]
[null,null,180]
[null,null,181]
[null,null,182]
[null,null,183]
[null,null,184]
[null,null,185]
[null,null,186]
[null,null,187]
[null,null,188]
[null,null,189]
[null,null,190]
[null,null,191]
[null,null,192]
[null,null,193]
[null,null,194]
[null,null,195]
[null,null,196]
[null,null,197]
[null,null,198]
[null,null,199]
[null,null,200]
[null,null,201]
[null,null,202]
[null,null,203]
[null,null,204]
[null,null,205]
[null,null,206]
[null,null,207]
[null,null,208]
[null,null,209]
[null,null,210]
[null,null,211]
[null,null,212]
[null,null,213]
[null,null,214]
[null,null,215]
[null,null,216]
[null,null,217]
[null,null,218]
[null,null,219]
[null,null,220]
[null,null,221]
[null,null,222]
[null,null,223]
[null,null,224]
[null,null,225]
[null,null,226]
[null,null,227]
[null,null,228]
[null,null,229]
[null,null,230]
[null,null,231]
[null,null,232]
[null,null,233]
[null,null,234]
[null,null,235]
[null,null,236]
[null,null,237]
[null,null,238]
[null,null,239]
[null,null,240]
[null,null,241]
[null,null,242]
[null,null,243]
[null,null,244]
[null,null,245]
[null,null,246]
[null,null,247]
[null,null,248]
[null,null,249]
[null,null,250]
[null,null,251]
[null,null,252]
[null,null,253]
[null,null,254]
[null,null,255]
[null,null,256]
[null,null,257]
[null,null,258]
[null,null,259]
[null,null,260]
[null,null,261]
[null,null,262]
[null,null,263]
[null,null,264]
[null,null,265]
[null,null,266]
[null,null,267]
[null,null,268]
[null,null,269]
[null,null,270]
[null,null,271]
[null,null,272]
[null,null,273]
[null,null,274]
[null,null,275]
[null,null,276]
[null,null,277]
[null,null,278]
[null,null,279]
[null,null,280]
[null,null,281]
[null,null,282]
[null,null,283]
[null,null,284]
[null,null,285]
[null,null,286]
[null,null,287]
[null,null,288]
[null,null,289]
[null,null,290]
[null,null,291]
[null,null,292]
[null,null,293]
[null,null,294]
[null,null,295]
[null,null,296]
[null,null,297]
[null,null,298]
[null,null,299]
[null,null,300]
[null,null,301]
[null,null,302]
[null,null,303]
[null,null,304]
[null,null,305]
[null,null,306]
[null,null,307]
[null,null,308]
[null,null,309]
[null,null,310]
[null,null,311]
[null,null,312]
[null,null,313]
[null,null,314]
[null,null,315]
[null,null,316]
[null,null,317]
[null,null,318]
[null,null,319]
[null,null,320]
[null,null,321]
[null,null,322]
[null,null,323]
[null,null,324]
[null,null,325]
[null,null,326]
[null,null,327]
[null,null,328]
[null,null,329]
[null,null,330]
[null,null,331]
[null,null,332]
[null,null,333]
[null,null,334]
[null,null,335]
[null,null,336]
[null,null,337]
[null,null,338]
[null,null,339]
[null,null,340]
[null,null,341]
[null,null,342]
[null,null,343]
[null,null,344]
[null,null,345]
[null,null,346]
[null,null,347]
[null,null,348]
[null,null,349]
[null,null,350]
[null,null,351]
[null,null,352]
[null,null,353]
[null,null,354]
[null,null,355]
[null,null,356]
[null,null,357]
[null,null,358]
[null,null,359]
[null,null,360]
[null,null,361]
[null,null,362]
[null,null,363]
[null,null,364]
[null,null,365]
[null,null,366]
[null,null,367]
[null,null,368]
[null,null,369]
[null,null,370]
[null,null,371]
[null,null,372]
[null,null,373]
[null,null,374]
[null,null,375]
[null,null,376]
[null,null,377]
[null,null,378]
[null,null,379]
[null,null,380]
[null,null,381]
[null,null,382]
[null,null,383]
[null,null,384]
[null,null,385]
[null,null,386]
[null,null,387]
[null,null,388]
[null,null,389]
[null,null,390]
[null,null,391]
[null,null,392]
[null,null,393]
[null,null,394]
[null,null,395]
[null,null,396]
[null,null,397]
[null,null,398]
[null,null,399]
[null,null,400]
[null,null,401]
[null,null,402]
[null,null,403]
[null,null,404]
[null,null,405]
[null,null,406]
[null,null,407]
[null,null,408]
[null,null,409]
[null,null,410]
[null,null,411]
[null,null,412]
[null,null,413]
[null,null,414]
[null,null,415]
[null,null,416]
[null,null,417]
[null,null,418]
[null,null,419]
[null,null,420]
[null,null,421]
[null,null,422]
[null,null,423]
[null,null,424]
[null,null,425]
[null,null,426]
[null,null,427]
[null,null,428]
[null,null,429]
[null,null,430]
[null,null,431]
[null,null,432]
[null,null,433]
[null,null,434]
[null,null,435]
[null,null,436]
[null,null,437]
[null,null,438]
[null,null,439]
[null,null,440]
[null,null,441]
[null,null,442]
[null,null,443]
[null,null,444]
[null,null,445]
[null,null,446]
[null,null,447]
[null,null,448]
[null,null,449]
[null,null,450]
[null,null,451]
[null,null,452]
[null,null,453]
[null,null,454]
[null,null,455]
[null,null,456]
[null,null,457]
[null,null,458]
[null,null,459]
[null,null,460]
[null,null,461]
[null,null,462]
[null,null,463]
[null,null,464]
[null,null,465]
[null,null,466]
[null,null,467]
[null,null,468]
[null,null,469]
[null,null,470]
[null,null,471]
[null,null,472]
[null,null,473]
[null,null,474]
[null,null,475]
[null,null,476]
[null,null,477]
[null,null,478]
[null,null,479]
[null,null,480]
[null,null,481]
[null,null,482]
[null,null,483]
[null,null,484]
[null,null,485]
[null,null,486]
[null,null,487]
[null,null,488]
[null,null,489]
[null,null,490]
[null,null,491]
[null,null,492]
[null,null,493]
[null,null,494]
[null,null,495]
[null,null,496]
[null,null,497]
[null,null,498]
[null,null,499]

{"sheet":"M172P_STATUS","index":2,"n_rows":510,"n_cols":21,"rows_kept":510,"cut":false,"hidden":false,"merged":[]}
[]
[]
[]
[]
[]
[]
[]
[]
[]
[null,null,"INDEX",null,"#","Address","Name","Device Type","Application Type","Size","Default Value","Min","Max","Scale","Offset","Unit","Format","Access Level","Read Only","Description","Note"]
[null,null,0,null,0,16384,"xVariable",5,"BOOL",null,0,null,null,1,0,null,null,3]
[null,null,1,null,1,16385,"iVariable",0,"INT",null,0,null,null,1,0,null,null,3]
[null,null,2,null,2,16386,"diVariable",1,"DINT",null,0,null,null,1,0,null,null,3]
[null,null,3,null,3,16388,"wVariable",2,"WORD",null,0,null,null,1,0,null,null,3]
[null,null,4,null,4,16389,"dwVariable",3,"DWORD",null,0,null,null,1,0,null,null,3]
[null,null,5,null,5,16391,"rVariable",4,"REAL",null,0,null,null,1,0,null,null,3]
[null,null,6,null,6,16393,"uiVariable",2,"UINT",null,0,null,null,1,0,null,null,3]
[null,null,7,null,7,16394,"udiVariable",3,"UDINT",null,0,null,null,1,0,null,null,3]
[null,null,8]
[null,null,9]
[null,null,10]
[null,null,11]
[null,null,12]
[null,null,13]
[null,null,14]
[null,null,15]
[null,null,16]
[null,null,17]
[null,null,18]
[null,null,19]
[null,null,20]
[null,null,21]
[null,null,22]
[null,null,23]
[null,null,24]
[null,null,25]
[null,null,26]
[null,null,27]
[null,null,28]
[null,null,29]
[null,null,30]
[null,null,31]
[null,null,32]
[null,null,33]
[null,null,34]
[null,null,35]
[null,null,36]
[null,null,37]
[null,null,38]
[null,null,39]
[null,null,40]
[null,null,41]
[null,null,42]
[null,null,43]
[null,null,44]
[null,null,45]
[null,null,46]
[null,null,47]
[null,null,48]
[null,null,49]
[null,null,50]
[null,null,51]
[null,null,52]
[null,null,53]
[null,null,54]
[null,null,55]
[null,null,56]
[null,null,57]
[null,null,58]
[null,null,59]
[null,null,60]
[null,null,61]
[null,null,62]
[null,null,63]
[null,null,64]
[null,null,65]
[null,null,66]
[null,null,67]
[null,null,68]
[null,null,69]
[null,null,70]
[null,null,71]
[null,null,72]
[null,null,73]
[null,null,74]
[null,null,75]
[null,null,76]
[null,null,77]
[null,null,78]
[null,null,79]
[null,null,80]
[null,null,81]
[null,null,82]
[null,null,83]
[null,null,84]
[null,null,85]
[null,null,86]
[null,null,87]
[null,null,88]
[null,null,89]
[null,null,90]
[null,null,91]
[null,null,92]
[null,null,93]
[null,null,94]
[null,null,95]
[null,null,96]
[null,null,97]
[null,null,98]
[null,null,99]
[null,null,100]
[null,null,101]
[null,null,102]
[null,null,103]
[null,null,104]
[null,null,105]
[null,null,106]
[null,null,107]
[null,null,108]
[null,null,109]
[null,null,110]
[null,null,111]
[null,null,112]
[null,null,113]
[null,null,114]
[null,null,115]
[null,null,116]
[null,null,117]
[null,null,118]
[null,null,119]
[null,null,120]
[null,null,121]
[null,null,122]
[null,null,123]
[null,null,124]
[null,null,125]
[null,null,126]
[null,null,127]
[null,null,128]
[null,null,129]
[null,null,130]
[null,null,131]
[null,null,132]
[null,null,133]
[null,null,134]
[null,null,135]
[null,null,136]
[null,null,137]
[null,null,138]
[null,null,139]
[null,null,140]
[null,null,141]
[null,null,142]
[null,null,143]
[null,null,144]
[null,null,145]
[null,null,146]
[null,null,147]
[null,null,148]
[null,null,149]
[null,null,150]
[null,null,151]
[null,null,152]
[null,null,153]
[null,null,154]
[null,null,155]
[null,null,156]
[null,null,157]
[null,null,158]
[null,null,159]
[null,null,160]
[null,null,161]
[null,null,162]
[null,null,163]
[null,null,164]
[null,null,165]
[null,null,166]
[null,null,167]
[null,null,168]
[null,null,169]
[null,null,170]
[null,null,171]
[null,null,172]
[null,null,173]
[null,null,174]
[null,null,175]
[null,null,176]
[null,null,177]
[null,null,178]
[null,null,179]
[null,null,180]
[null,null,181]
[null,null,182]
[null,null,183]
[null,null,184]
[null,null,185]
[null,null,186]
[null,null,187]
[null,null,188]
[null,null,189]
[null,null,190]
[null,null,191]
[null,null,192]
[null,null,193]
[null,null,194]
[null,null,195]
[null,null,196]
[null,null,197]
[null,null,198]
[null,null,199]
[null,null,200]
[null,null,201]
[null,null,202]
[null,null,203]
[null,null,204]
[null,null,205]
[null,null,206]
[null,null,207]
[null,null,208]
[null,null,209]
[null,null,210]
[null,null,211]
[null,null,212]
[null,null,213]
[null,null,214]
[null,null,215]
[null,null,216]
[null,null,217]
[null,null,218]
[null,null,219]
[null,null,220]
[null,null,221]
[null,null,222]
[null,null,223]
[null,null,224]
[null,null,225]
[null,null,226]
[null,null,227]
[null,null,228]
[null,null,229]
[null,null,230]
[null,null,231]
[null,null,232]
[null,null,233]
[null,null,234]
[null,null,235]
[null,null,236]
[null,null,237]
[null,null,238]
[null,null,239]
[null,null,240]
[null,null,241]
[null,null,242]
[null,null,243]
[null,null,244]
[null,null,245]
[null,null,246]
[null,null,247]
[null,null,248]
[null,null,249]
[null,null,250]
[null,null,251]
[null,null,252]
[null,null,253]
[null,null,254]
[null,null,255]
[null,null,256]
[null,null,257]
[null,null,258]
[null,null,259]
[null,null,260]
[null,null,261]
[null,null,262]
[null,null,263]
[null,null,264]
[null,null,265]
[null,null,266]
[null,null,267]
[null,null,268]
[null,null,269]
[null,null,270]
[null,null,271]
[null,null,272]
[null,null,273]
[null,null,274]
[null,null,275]
[null,null,276]
[null,null,277]
[null,null,278]
[null,null,279]
[null,null,280]
[null,null,281]
[null,null,282]
[null,null,283]
[null,null,284]
[null,null,285]
[null,null,286]
[null,null,287]
[null,null,288]
[null,null,289]
[null,null,290]
[null,null,291]
[null,null,292]
[null,null,293]
[null,null,294]
[null,null,295]
[null,null,296]
[null,null,297]
[null,null,298]
[null,null,299]
[null,null,300]
[null,null,301]
[null,null,302]
[null,null,303]
[null,null,304]
[null,null,305]
[null,null,306]
[null,null,307]
[null,null,308]
[null,null,309]
[null,null,310]
[null,null,311]
[null,null,312]
[null,null,313]
[null,null,314]
[null,null,315]
[null,null,316]
[null,null,317]
[null,null,318]
[null,null,319]
[null,null,320]
[null,null,321]
[null,null,322]
[null,null,323]
[null,null,324]
[null,null,325]
[null,null,326]
[null,null,327]
[null,null,328]
[null,null,329]
[null,null,330]
[null,null,331]
[null,null,332]
[null,null,333]
[null,null,334]
[null,null,335]
[null,null,336]
[null,null,337]
[null,null,338]
[null,null,339]
[null,null,340]
[null,null,341]
[null,null,342]
[null,null,343]
[null,null,344]
[null,null,345]
[null,null,346]
[null,null,347]
[null,null,348]
[null,null,349]
[null,null,350]
[null,null,351]
[null,null,352]
[null,null,353]
[null,null,354]
[null,null,355]
[null,null,356]
[null,null,357]
[null,null,358]
[null,null,359]
[null,null,360]
[null,null,361]
[null,null,362]
[null,null,363]
[null,null,364]
[null,null,365]
[null,null,366]
[null,null,367]
[null,null,368]
[null,null,369]
[null,null,370]
[null,null,371]
[null,null,372]
[null,null,373]
[null,null,374]
[null,null,375]
[null,null,376]
[null,null,377]
[null,null,378]
[null,null,379]
[null,null,380]
[null,null,381]
[null,null,382]
[null,null,383]
[null,null,384]
[null,null,385]
[null,null,386]
[null,null,387]
[null,null,388]
[null,null,389]
[null,null,390]
[null,null,391]
[null,null,392]
[null,null,393]
[null,null,394]
[null,null,395]
[null,null,396]
[null,null,397]
[null,null,398]
[null,null,399]
[null,null,400]
[null,null,401]
[null,null,402]
[null,null,403]
[null,null,404]
[null,null,405]
[null,null,406]
[null,null,407]
[null,null,408]
[null,null,409]
[null,null,410]
[null,null,411]
[null,null,412]
[null,null,413]
[null,null,414]
[null,null,415]
[null,null,416]
[null,null,417]
[null,null,418]
[null,null,419]
[null,null,420]
[null,null,421]
[null,null,422]
[null,null,423]
[null,null,424]
[null,null,425]
[null,null,426]
[null,null,427]
[null,null,428]
[null,null,429]
[null,null,430]
[null,null,431]
[null,null,432]
[null,null,433]
[null,null,434]
[null,null,435]
[null,null,436]
[null,null,437]
[null,null,438]
[null,null,439]
[null,null,440]
[null,null,441]
[null,null,442]
[null,null,443]
[null,null,444]
[null,null,445]
[null,null,446]
[null,null,447]
[null,null,448]
[null,null,449]
[null,null,450]
[null,null,451]
[null,null,452]
[null,null,453]
[null,null,454]
[null,null,455]
[null,null,456]
[null,null,457]
[null,null,458]
[null,null,459]
[null,null,460]
[null,null,461]
[null,null,462]
[null,null,463]
[null,null,464]
[null,null,465]
[null,null,466]
[null,null,467]
[null,null,468]
[null,null,469]
[null,null,470]
[null,null,471]
[null,null,472]
[null,null,473]
[null,null,474]
[null,null,475]
[null,null,476]
[null,null,477]
[null,null,478]
[null,null,479]
[null,null,480]
[null,null,481]
[null,null,482]
[null,null,483]
[null,null,484]
[null,null,485]
[null,null,486]
[null,null,487]
[null,null,488]
[null,null,489]
[null,null,490]
[null,null,491]
[null,null,492]
[null,null,493]
[null,null,494]
[null,null,495]
[null,null,496]
[null,null,497]
[null,null,498]
[null,null,499]

{"sheet":"CONTACT","index":3,"n_rows":18,"n_cols":3,"rows_kept":18,"cut":false,"hidden":false,"merged":[[13,1,17,1],[9,1,11,1]]}
[]
[]
[]
[]
[]
[]
[]
[]
[]
[null,"Publisher","Schneider Electric Argentina S.A."]
[null,null,"Av. Gral. San Martín 5020 (B1604CDY) – Florida"]
[null,null,"Pcia. De Buenos Aires - Argentina"]
[]
[null,"Author","Eng. Spec. Leandro Tomas Oscar AHUMADA"]
[null,null,"Application Design Engineer"]
[null,null,"Phone: (+54 11) 4730-8888 Ext:772"]
[null,null,"Mobile: (+54 9 11) 2343-5328"]
[null,null,"e-mail: leandro.ahumada@schneider-electric.com"]